{"text_format":"1","workbook":"xlsx","n_sheets":10,"sheets":["Synthèse","CdC","Déclinaison projet","Elève A","Elève B","Elève C","Elève D","Elève E","MODE EMPLOI","parametres"],"not_rendered":{"charts":0,"images":4,"macros":1,"external_links":0,"defined_names":38,"comments":0,"pivot_tables":0},"unopened":[],"bounds":{"document_bytes":16777216,"sheet_cells":100000,"rows_first":2000,"rows_last":500,"rows_between":2000,"halvings":0,"cell_chars":16384,"cell_head_chars":4096},"cells_cut":0,"cells_raw":0,"read":"whole","date_system":"1900"}

{"sheet":"Synthèse","index":0,"n_rows":29,"n_cols":13,"rows_kept":29,"cut":false,"hidden":false,"merged":[[11,2,12,5],[16,2,16,3],[16,4,16,12],[14,2,14,3],[0,7,2,11],[2,2,2,5],[4,2,4,3],[4,8,4,12],[8,2,9,5],[5,7,12,12],[7,3,7,5],[10,3,10,5],[5,2,6,5],[25,2,25,3],[25,5,25,7],[22,12,23,12],[19,2,19,3],[14,4,14,5],[18,8,18,10]]}
[]
[]
[]
[]
[null,null,"INTITULE DU PROJET ",null,"Effectif :  ",null,null,"SUPPORT","Coller une image donnant un repère visuel du projet"]
[null,null,"Alimentation d’un chalet isolé avec la génératrice Fit Lux"]
[]
[null,null,"ENJEU","Question de société, enjeu du DD , …"]
[null,null,"Amélioration du confort d'une chalet d'alpage"]
[]
[null,null,"PROBLEMATIQUE","Problème technique à résoudre"]
[null,null,"Un chalet en haute montagne peu confortable doit être amélioré : Les randonneurs et des scientifiques nécessitent un apport d’électricité pour alimenter :\n• le matériel informatique ( ordinateur )  une borne  WIFI.\n• Une prise USB pour pouvoir recharger d’urgence un téléphone portable par la génératrice linéaire Fit Lux. \n"]
[]
[]
[null,null,"PROFESSEUR REFERENT :"]
[]
[null,null,"EQUIPE PEDAGOGIQUE associée :",null,"Support technique de l'entreprise DIDASTEL"]
[]
[null,null,null,null,null,null,null,null,"Compétences évaluABLES"]
[null,null,"ELEVES du groupe de projet : ",null,"Nom","Prénom","Section",null,"Revues","Soutenance","GLOBAL","Charge horaire"]
[null,null,null,"Elève A :","eleve A",null,null,null,{"$f":"'Elève A'!P1","v":0.85106382978723405},{"$f":"'Elève A'!Q1","v":0.51515151515151514},{"$f":"'Elève A'!R1","v":0.71250000000000002},{"$f":"'Déclinaison projet'!F8","v":96}]
[null,null,null,"Elève B :","eleve B",null,null,null,{"$f":"'Elève B'!P1","v":0.78723404255319152},{"$f":"'Elève B'!Q1","v":0.54545454545454541},{"$f":"#REF!","v":{"$error":"#REF!"}},{"$f":"'Déclinaison projet'!G8","v":97},"Pluridisciplinarité :"]
[null,null,null,"Elève C :","eleve C ",null,null,null,{"$f":"'Elève C'!P1","v":0.78723404255319152},{"$f":"'Elève C'!Q1","v":0.54545454545454541},{"$f":"#REF!","v":{"$error":"#REF!"}},{"$f":"'Déclinaison projet'!H8","v":98},"Intervention de professeur(s) non-STI (sciences, LV…)"]
[null,null,null,"Elève D :","D","d",null,null,{"$f":"'Elève D'!P1","v":"X"},{"$f":"'Elève D'!Q1","v":"X"},{"$f":"#REF!","v":{"$error":"#REF!"}},{"$f":"'Déclinaison projet'!I8","v":"X"}]
[null,null,null,"Elève E :","E","e",null,null,{"$f":"'Elève E'!P1","v":"X"},{"$f":"'Elève E'!Q1","v":"X"},{"$f":"#REF!","v":{"$error":"#REF!"}},{"$f":"'Déclinaison projet'!J8","v":"X"},{"$f":"'Déclinaison projet'!N9","v":"NON"}]
[]
[]
[null,null,null,null,null,null,null,null,null,"   % d'indicateurs évaluables à la soutenance"]
[null,null,null,null,null,null,null,null,"   % d'indicateurs évaluables lors des revues de projet"]

{"sheet":"CdC","index":1,"n_rows":6,"n_cols":7,"rows_kept":6,"cut":false,"hidden":false,"merged":[[4,2,4,3]]}
[]
[]
[]
[]
[null,null,"FONCTIONS DE SERVICE",null,"CRITERES","NIVEAUX","FLEXIBILITE"]
[null,null,null,"Cahier des Charges Fitlux"]

{"sheet":"Déclinaison projet","index":2,"n_rows":170,"n_cols":25,"rows_kept":170,"cut":false,"hidden":false,"merged":[[0,3,0,4],[8,11,8,12]]}
[]
[]
[]
[]
[]
[null,null,null,null,null,"Elève A:","Elève B:","Elève C:","Elève D:","Elève E:"]
[null,null,null,null,null,{"$f":"Synthèse!E21","v":"eleve A"},{"$f":"Synthèse!E22","v":"eleve B"},{"$f":"Synthèse!E23","v":"eleve C "},{"$f":"Synthèse!E24","v":"D"},{"$f":"Synthèse!E25","v":"E"}]
[null,null,null,null,"Charge horaire élève (cible = 100h) :",{"$f":"IF(parametres!G2>1,SUM(O10:O170),\"X\")","v":96},{"$f":"IF(parametres!G3>1,SUM(P10:P170),\"X\")","v":97},{"$f":"IF(parametres!G4>1,SUM(Q10:Q170),\"X\")","v":98},{"$f":"IF(parametres!G5>1,SUM(R10:R170),\"X\")","v":"X"},{"$f":"IF(parametres!G6>1,SUM(S10:S170),\"X\")","v":"X"}]
[null,null,null,"ETAPES / TACHES","volume horaire (h)",null,null,null,null,null,null,"Contribution de professeurs non-STI",null,{"$f":"IF(COUNTA(L10:L170)>0,\"OUI\",\"NON\")","v":"NON"},"tA","tB","tC","tD","tE",null,"TA","TB","TC","TD","TE"]
[null,null,null,"SPECIFICATION / PLANIFICATION",null,null,null,null,"Nombre de lignes à afficher :",null,null,null,"discipline(s)",6,{"$f":"IF(F10=\"x\",$E10,0)","v":0},{"$f":"IF(G10=\"x\",$E10,0)","v":0},{"$f":"IF(H10=\"x\",$E10,0)","v":0},{"$f":"IF(I10=\"x\",$E10,0)","v":0},{"$f":"IF(J10=\"x\",$E10,0)","v":0},null,{"$f":"IF(F10=\"x\",$D10,\"\")","v":""},"","","",{"$f":"IF(L10=\"x\",$D10,\"\")","v":""}]
[null,null,1,"Compléter l’analyse fonctionnelle du système existant",2,"x","x","x",null,null,null,null,null,null,{"$f":"IF(F11=\"x\",$E11,0)","v":2},{"$f":"IF(G11=\"x\",$E11,0)","v":2},{"$f":"IF(H11=\"x\",$E11,0)","v":2},{"$f":"IF(I11=\"x\",$E11,0)","v":0},0,null,"Compléter l’analyse fonctionnelle du système existant","Compléter l’analyse fonctionnelle du système existant","Compléter l’analyse fonctionnelle du système existant","",{"$f":"IF(J11=\"x\",$D11,\"\")","v":""}]
[null,null,2,"Compléter l’analyse fonctionnelle du système modifié",2,"x","x","x",null,null,null,null,null,null,{"$f":"IF(F12=\"x\",$E12,0)","v":2},{"$f":"IF(G12=\"x\",$E12,0)","v":2},{"$f":"IF(H12=\"x\",$E12,0)","v":2},{"$f":"IF(I12=\"x\",$E12,0)","v":0},0,null,{"$f":"IF(F12=\"x\",$D12,\"\")","v":"Compléter l’analyse fonctionnelle du système modifié"},{"$f":"IF(G12=\"x\",$D12,\"\")","v":"Compléter l’analyse fonctionnelle du système modifié"},{"$f":"IF(H12=\"x\",$D12,\"\")","v":"Compléter l’analyse fonctionnelle du système modifié"},{"$f":"IF(I12=\"x\",$D12,\"\")","v":""},{"$f":"IF(J12=\"x\",$D12,\"\")","v":""}]
[null,null,3,"Compléter le diagramme d’organisation des tâches (WBS)",3,"x","x","x",null,null,null,null,null,null,3,3,3,0,0,null,"Compléter le diagramme d’organisation des tâches (WBS)","Compléter le diagramme d’organisation des tâches (WBS)","Compléter le diagramme d’organisation des tâches (WBS)","",""]
[null,null,4,"Compléter le planning et le faire vivre ( diagramme de GANTT)",3,"x","x","x",null,null,null,null,null,null,3,3,3,0,0,null,"Compléter le planning et le faire vivre ( diagramme de GANTT)","Compléter le planning et le faire vivre ( diagramme de GANTT)","Compléter le planning et le faire vivre ( diagramme de GANTT)","",""]
[null,null,5,"S'approprier le CDCF ( avec le client éventuellement )",1,"x","x","x",null,null,null,null,null,null,1,1,1,0,0,null,"S'approprier le CDCF ( avec le client éventuellement )","S'approprier le CDCF ( avec le client éventuellement )","S'approprier le CDCF ( avec le client éventuellement )","",""]
[null,null,6,"Structurer le travail de groupe ( identifier les découpages possibles)",1,"x","x","x",null,null,null,null,null,null,1,1,1,0,0,null,"Structurer le travail de groupe ( identifier les découpages possibles)","Structurer le travail de groupe ( identifier les découpages possibles)","Structurer le travail de groupe ( identifier les découpages possibles)","",""]
[null,null,7,"…",null,null,null,null,null,null,null,null,null,null,0,0,0,0,0,null,"","","","",""]
[null,null,8,"…",null,null,null,null,null,null,null,null,null,null,0,0,0,0,0,null,"","","","",""]
[null,null,9,"…",null,null,null,null,null,null,null,null,null,null,0,0,0,0,0,null,"","","","",""]
[null,null,10,"…",null,null,null,null,null,null,null,null,null,null,0,0,0,0,0,null,"","","","",""]
[null,null,11,"…",null,null,null,null,null,null,null,null,null,null,0,0,0,0,0,null,"","","","",""]
[null,null,12,"…",null,null,null,null,null,null,null,null,null,null,0,0,0,0,0,null,"","","","",""]
[null,null,13,"…",null,null,null,null,null,null,null,null,null,null,0,0,0,0,0,null,"","","","",""]
[null,null,14,"…",null,null,null,null,null,null,null,null,null,null,0,0,0,0,0,null,"","","","",""]
[null,null,15,"…",null,null,null,null,null,null,null,null,null,null,0,0,0,0,0,null,"","","","",""]
[null,null,16,"…",null,null,null,null,null,null,null,null,null,null,0,0,0,0,0,null,"","","","",""]
[null,null,17,"…",null,null,null,null,null,null,null,null,null,null,0,0,0,0,{"$f":"IF(J27=\"x\",$E27,0)","v":0},null,"","","","",""]
[null,null,18,"…",null,null,null,null,null,null,null,null,null,null,0,0,0,0,0,null,"","","","",""]
[null,null,19,"…",null,null,null,null,null,null,null,null,null,null,0,0,0,0,0,null,"","","","",""]
[null,null,20,"…",null,null,null,null,null,null,null,null,null,null,0,0,0,0,0,null,"","","","",""]
[null,null,21,"…",null,null,null,null,null,null,null,null,null,null,0,0,0,0,0,null,"","","","",""]
[null,null,22,"…",null,null,null,null,null,null,null,null,null,null,0,0,0,0,0,null,"","","","",""]
[null,null,23,"…",null,null,null,null,null,null,null,null,null,null,0,0,0,0,0,null,"","","","",""]
[null,null,24,"…",null,null,null,null,null,null,null,null,null,null,0,0,0,0,0,null,"","","","",""]
[null,null,25,"…",null,null,null,null,null,null,null,null,null,null,0,0,0,0,0,null,"","","","",""]
[null,null,26,"…",null,null,null,null,null,null,null,null,null,null,0,0,0,0,0,null,"","","","",""]
[null,null,27,"…",null,null,null,null,null,null,null,null,null,null,0,0,0,0,0,null,"","","","",""]
[null,null,28,"…",null,null,null,null,null,null,null,null,null,null,0,0,0,0,0,null,"","","","",""]
[null,null,29,"…",null,null,null,null,null,null,null,null,null,null,0,0,0,0,0,null,"","","","",""]
[null,null,30,"…",null,null,null,null,null,null,null,null,null,null,0,0,0,0,0,null,"","","","",""]
[null,null,null,"REVUE DE PROJET - Planification",null,null,null,null,"SUPPORT d'EVALUATION :","NON",null,null,null,null,{"$f":"IF(F41=\"x\",$E41,0)","v":0},0,0,0,0,null,{"$f":"IF($J41=\"OUI\",$D41,\"\")","v":""},{"$f":"IF($J41=\"OUI\",$D41,\"\")","v":""},{"$f":"IF($J41=\"OUI\",$D41,\"\")","v":""},{"$f":"IF($J41=\"OUI\",$D41,\"\")","v":""},{"$f":"IF($J41=\"OUI\",$D41,\"\")","v":""}]
[null,null,null,"CONCEPTION PRELIMINAIRE",null,null,null,null,"Nombre de lignes à afficher :",null,null,null,null,7,0,0,0,0,0,null,"","","",{"$f":"IF(I42=\"x\",$D42,\"\")","v":""},""]
[null,null,1,"Analyse de la chaine d'énergie du système Fitlux",7,"x","x","x",null,null,null,null,null,null,7,7,7,0,0,null,"Analyse de la chaine d'énergie du système Fitlux","Analyse de la chaine d'énergie du système Fitlux","Analyse de la chaine d'énergie du système Fitlux","",""]
[null,null,2,"Evaluer la prodcution d'énergie de la génératrice",4,"x","x","x",null,null,null,null,null,null,4,4,4,0,0,null,"Evaluer la prodcution d'énergie de la génératrice","Evaluer la prodcution d'énergie de la génératrice","Evaluer la prodcution d'énergie de la génératrice","",""]
[null,null,3,"Effectuer un bilan de puissance des besoins",4,null,"x",null,null,null,null,null,null,null,0,4,0,0,0,null,"","Effectuer un bilan de puissance des besoins","","",""]
[null,null,4,"Proposer un système de stokage",7,"x",null,null,null,null,null,null,null,null,7,0,0,0,0,null,"Proposer un système de stokage","","","",""]
[null,null,5,"Proposer une structure d’alimentation photovoltaîque",3,null,null,"x",null,null,null,null,null,null,0,0,3,0,0,null,"","","Proposer une structure d’alimentation photovoltaîque","",""]
[null,null,6,"Evaluer la production d'énergie de 10 m² de panneaux",7,"x","x","x",null,null,null,null,null,null,7,7,7,0,0,null,"Evaluer la production d'énergie de 10 m² de panneaux","Evaluer la production d'énergie de 10 m² de panneaux","Evaluer la production d'énergie de 10 m² de panneaux","",""]
[null,null,7,"Déterminer les caractéristique d'une prise USB",4,"x",null,null,null,null,null,null,null,null,4,0,0,0,0,null,"Déterminer les caractéristique d'une prise USB","","","",""]
[null,null,8,"…",null,null,null,null,null,null,null,null,null,null,0,0,0,0,0,null,"","","","",""]
[null,null,9,"…",null,null,null,null,null,null,null,null,null,null,0,0,0,0,0,null,"","","","",""]
[null,null,10,"…",null,null,null,null,null,null,null,null,null,null,0,0,0,0,0,null,"","","","",""]
[null,null,11,"…",null,null,null,null,null,null,null,null,null,null,0,0,0,0,0,null,"","","","",""]
[null,null,12,"…",null,null,null,null,null,null,null,null,null,null,0,0,0,0,0,null,"","","","",""]
[null,null,13,"…",null,null,null,null,null,null,null,null,null,null,0,0,0,0,0,null,"","","","",""]
[null,null,14,"…",null,null,null,null,null,null,null,null,null,null,0,0,0,0,0,null,"","","","",""]
[null,null,15,"…",null,null,null,null,null,null,null,null,null,null,0,0,0,0,0,null,"","","","",""]
[null,null,16,"…",null,null,null,null,null,null,null,null,null,null,0,0,0,0,0,null,"","","","",""]
[null,null,17,"…",null,null,null,null,null,null,null,null,null,null,0,0,0,0,0,null,"","","","",""]
[null,null,18,"…",null,null,null,null,null,null,null,null,null,null,0,0,0,0,0,null,"","","","",""]
[null,null,19,"…",null,null,null,null,null,null,null,null,null,null,0,0,0,0,0,null,"","","","",""]
[null,null,20,"…",null,null,null,null,null,null,null,null,null,null,0,0,0,0,0,null,"","","","",""]
[null,null,21,"…",null,null,null,null,null,null,null,null,null,null,0,0,0,0,0,null,"","","","",""]
[null,null,22,"…",null,null,null,null,null,null,null,null,null,null,0,0,0,0,0,null,"","","","",""]
[null,null,23,"…",null,null,null,null,null,null,null,null,null,null,0,0,0,0,0,null,"","","","",""]
[null,null,24,"…",null,null,null,null,null,null,null,null,null,null,0,0,0,0,0,null,"","","","",""]
[null,null,25,"…",null,null,null,null,null,null,null,null,null,null,0,0,0,0,0,null,"","","","",""]
[null,null,26,"…",null,null,null,null,null,null,null,null,null,null,0,0,0,0,0,null,"","","","",""]
[null,null,27,"…",null,null,null,null,null,null,null,null,null,null,0,0,0,0,0,null,"","","","",""]
[null,null,28,"…",null,null,null,null,null,null,null,null,null,null,0,0,0,0,0,null,"","","","",""]
[null,null,29,"…",null,null,null,null,null,null,null,null,null,null,0,0,0,0,0,null,"","","","",""]
[null,null,30,"…",null,null,null,null,null,null,null,null,null,null,0,0,0,0,0,null,"","","","",""]
[null,null,null,"REVUE DE PROJET - Conception préliminaire",null,"x",null,null,"SUPPORT d'EVALUATION :","OUI",null,null,null,null,0,0,0,0,0,null,{"$f":"IF($J73=\"OUI\",$D73,\"\")","v":"REVUE DE PROJET - Conception préliminaire"},{"$f":"IF($J73=\"OUI\",$D73,\"\")","v":"REVUE DE PROJET - Conception préliminaire"},{"$f":"IF($J73=\"OUI\",$D73,\"\")","v":"REVUE DE PROJET - Conception préliminaire"},{"$f":"IF($J73=\"OUI\",$D73,\"\")","v":"REVUE DE PROJET - Conception préliminaire"},{"$f":"IF($J73=\"OUI\",$D73,\"\")","v":"REVUE DE PROJET - Conception préliminaire"}]
[null,null,null,"CONCEPTION DETAILLEE",null,null,null,null,"Nombre de lignes à afficher :",null,null,null,null,8,0,0,0,0,0,null,"","","","",""]
[null,null,1,"Détermination du schéma de circuit de puissance et de commande",8,"x",null,null,null,null,null,null,null,null,8,0,0,0,0,null,"Détermination du schéma de circuit de puissance et de commande","","","",""]
[null,null,2,"Détermination du schéma électrique des structures matérielles assurant la communication Wifi",7,null,"x",null,null,null,null,null,null,null,{"$f":"IF(F76=\"x\",$E76,0)","v":0},{"$f":"IF(G76=\"x\",$E76,0)","v":7},{"$f":"IF(H76=\"x\",$E76,0)","v":0},{"$f":"IF(I76=\"x\",$E76,0)","v":0},0,null,{"$f":"IF(F76=\"x\",$D76,\"\")","v":""},{"$f":"IF(G76=\"x\",$D76,\"\")","v":"Détermination du schéma électrique des structures matérielles assurant la communication Wifi"},{"$f":"IF(H76=\"x\",$D76,\"\")","v":""},{"$f":"IF(I76=\"x\",$D76,\"\")","v":""},{"$f":"IF(J76=\"x\",$D76,\"\")","v":""}]
[null,null,3,"Créée une maquette 3D du Prototype sketchup",10,null,null,"x",null,null,null,null,null,null,0,0,10,0,0,null,"","","Créée une maquette 3D du Prototype sketchup","",""]
[null,null,4,"Concevoir un réseau WIFI sur Packet Tracer",7,null,"x",null,null,null,null,null,null,null,0,7,0,0,0,null,"","Concevoir un réseau WIFI sur Packet Tracer","","",""]
[null,null,5,"Déterminer l'interface entre la génératrice et la prise USB par un modèle de simulation sur PROTEUS",4,"x",null,null,null,null,null,null,null,null,4,0,0,0,0,null,"Déterminer l'interface entre la génératrice et la prise USB par un modèle de simulation sur PROTEUS","","","",""]
[null,null,6,"Déterminer l'interface entre la batterie et la prise électrique",8,null,null,"x",null,null,null,null,null,null,0,0,8,0,0,null,"","","Déterminer l'interface entre la batterie et la prise électrique","",""]
[null,null,7,"Chiffrer le projet par un devis",3,"x","x","x",null,null,null,null,null,null,3,3,3,0,0,null,"Chiffrer le projet par un devis","Chiffrer le projet par un devis","Chiffrer le projet par un devis","",""]
[null,null,8,"Préparer le bon de commande des matériels",4,"x","x","x",null,null,null,null,null,null,4,4,4,0,0,null,"Préparer le bon de commande des matériels","Préparer le bon de commande des matériels","Préparer le bon de commande des matériels","",""]
[null,null,9,"…",null,null,null,null,null,null,null,null,null,null,0,0,0,0,0,null,"","","","",""]
[null,null,10,"…",null,null,null,null,null,null,null,null,null,null,0,0,0,0,0,null,"","","","",""]
[null,null,11,"…",null,null,null,null,null,null,null,null,null,null,0,0,0,0,0,null,"","","","",""]
[null,null,12,"…",null,null,null,null,null,null,null,null,null,null,0,0,0,0,0,null,"","","","",""]
[null,null,13,"…",null,null,null,null,null,null,null,null,null,null,0,0,0,0,0,null,"","","","",""]
[null,null,14,"…",null,null,null,null,null,null,null,null,null,null,0,0,0,0,0,null,"","","","",""]
[null,null,15,"…",null,null,null,null,null,null,null,null,null,null,0,0,0,0,0,null,"","","","",""]
[null,null,16,"…",null,null,null,null,null,null,null,null,null,null,0,0,0,0,0,null,"","","","",""]
[null,null,17,"…",null,null,null,null,null,null,null,null,null,null,0,0,0,0,{"$f":"IF(J91=\"x\",$E91,0)","v":0},null,"","","","",""]
[null,null,18,"…",null,null,null,null,null,null,null,null,null,null,0,0,0,0,0,null,"","","","",""]
[null,null,19,"…",null,null,null,null,null,null,null,null,null,null,0,0,0,0,0,null,"","","","",""]
[null,null,20,"…",null,null,null,null,null,null,null,null,null,null,0,0,0,0,0,null,"","","","",""]
[null,null,21,"…",null,null,null,null,null,null,null,null,null,null,0,0,0,0,0,null,"","","","",""]
[null,null,22,"…",null,null,null,null,null,null,null,null,null,null,0,0,0,0,0,null,"","","","",""]
[null,null,23,"…",null,null,null,null,null,null,null,null,null,null,0,0,0,0,0,null,"","","","",""]
[null,null,24,"…",null,null,null,null,null,null,null,null,null,null,0,0,0,0,0,null,"","","","",""]
[null,null,25,"…",null,null,null,null,null,null,null,null,null,null,0,0,0,0,0,null,"","","","",""]
[null,null,26,"…",null,null,null,null,null,null,null,null,null,null,0,0,0,0,0,null,"","","","",""]
[null,null,27,"…",null,null,null,null,null,null,null,null,null,null,0,0,0,0,0,null,"","","","",""]
[null,null,28,"…",null,null,null,null,null,null,null,null,null,null,0,0,0,0,0,null,"","","","",""]
[null,null,29,"…",null,null,null,null,null,null,null,null,null,null,0,0,0,0,0,null,"","","","",""]
[null,null,30,"…",null,null,null,null,null,null,null,null,null,null,0,0,0,0,0,null,"","","","",""]
[null,null,null,"REVUE DE PROJET - Conception détaillée",null,"x",null,null,"SUPPORT d'EVALUATION :","OUI",null,null,null,null,0,0,0,0,0,null,{"$f":"IF($J105=\"OUI\",$D105,\"\")","v":"REVUE DE PROJET - Conception détaillée"},{"$f":"IF($J105=\"OUI\",$D105,\"\")","v":"REVUE DE PROJET - Conception détaillée"},{"$f":"IF($J105=\"OUI\",$D105,\"\")","v":"REVUE DE PROJET - Conception détaillée"},{"$f":"IF($J105=\"OUI\",$D105,\"\")","v":"REVUE DE PROJET - Conception détaillée"},{"$f":"IF($J105=\"OUI\",$D105,\"\")","v":"REVUE DE PROJET - Conception détaillée"}]
[null,null,null,"PROTOTYPAGE / REALISATION",null,null,null,null,"Nombre de lignes à afficher :",null,null,null,null,9,0,0,0,0,0,null,"","","","",""]
[null,null,1,"Câblage des panneaux photovolaîques",4,null,null,"x",null,null,null,null,null,null,0,0,4,0,0,null,"","","Câblage des panneaux photovolaîques","",""]
[null,null,2,"Câblage des structures matérielles assurant la communication WIFI",7,null,"x",null,null,null,null,null,null,null,0,7,0,0,0,null,"","Câblage des structures matérielles assurant la communication WIFI","","",""]
[null,null,3,"Configuer le réseau Wifi",7,null,"x",null,null,null,null,null,null,null,0,7,0,0,0,null,"","Configuer le réseau Wifi","","",""]
[null,null,4,"Réceptionner le matériel ",3,null,null,"x",null,null,null,null,null,null,0,0,3,0,0,null,"","","Réceptionner le matériel ","",""]
[null,null,5,"Câblage du circuit d'éclairage",3,null,null,"x",null,null,null,null,null,null,0,0,3,0,0,null,"","","Câblage du circuit d'éclairage","",""]
[null,null,6,"Créer une struture du prototype",10,"x","x","x",null,null,null,null,null,null,10,10,10,0,0,null,"Créer une struture du prototype","Créer une struture du prototype","Créer une struture du prototype","",""]
[null,null,7,"Câblage de La prise USB et de l'interface",4,"x",null,null,null,null,null,null,null,null,4,0,0,0,0,null,"Câblage de La prise USB et de l'interface","","","",""]
[null,null,8,"Esthétique du prototype",4,"x","x","x",null,null,null,null,null,null,4,4,4,0,0,null,"Esthétique du prototype","Esthétique du prototype","Esthétique du prototype","",""]
[null,null,9,"Cablage de l'interface entre la batterie et la prise électrique",2,null,null,"x",null,null,null,null,null,null,0,0,2,0,0,null,"","","Cablage de l'interface entre la batterie et la prise électrique","",""]
[null,null,10,"…",null,null,null,null,null,null,null,null,null,null,0,0,0,0,0,null,"","","","",""]
[null,null,11,"…",null,null,null,null,null,null,null,null,null,null,0,0,0,0,0,null,"","","","",""]
[null,null,12,"…",null,null,null,null,null,null,null,null,null,null,0,0,0,0,0,null,"","","","",""]
[null,null,13,"…",null,null,null,null,null,null,null,null,null,null,0,0,0,0,0,null,"","","","",""]
[null,null,14,"…",null,null,null,null,null,null,null,null,null,null,0,0,0,0,0,null,"","","","",""]
[null,null,15,"…",null,null,null,null,null,null,null,null,null,null,0,0,0,0,0,null,"","","","",""]
[null,null,16,"…",null,null,null,null,null,null,null,null,null,null,0,0,0,0,0,null,"","","","",""]
[null,null,17,"…",null,null,null,null,null,null,null,null,null,null,0,0,0,0,0,null,"","","","",""]
[null,null,18,"…",null,null,null,null,null,null,null,null,null,null,0,0,0,0,0,null,"","","","",""]
[null,null,19,"…",null,null,null,null,null,null,null,null,null,null,0,0,0,0,0,null,"","","","",""]
[null,null,20,"…",null,null,null,null,null,null,null,null,null,null,0,0,0,0,0,null,"","","","",""]
[null,null,21,"…",null,null,null,null,null,null,null,null,null,null,0,0,0,0,0,null,"","","","",""]
[null,null,22,"…",null,null,null,null,null,null,null,null,null,null,0,0,0,0,0,null,"","","","",""]
[null,null,23,"…",null,null,null,null,null,null,null,null,null,null,0,0,0,0,0,null,"","","","",""]
[null,null,24,"…",null,null,null,null,null,null,null,null,null,null,0,0,0,0,0,null,"","","","",""]
[null,null,25,"…",null,null,null,null,null,null,null,null,null,null,0,0,0,0,0,null,"","","","",""]
[null,null,26,"…",null,null,null,null,null,null,null,null,null,null,0,0,0,0,0,null,"","","","",""]
[null,null,27,"…",null,null,null,null,null,null,null,null,null,null,0,0,0,0,0,null,"","","","",""]
[null,null,28,"…",null,null,null,null,null,null,null,null,null,null,0,0,0,0,0,null,"","","","",""]
[null,null,29,"…",null,null,null,null,null,null,null,null,null,null,0,0,0,0,0,null,"","","","",""]
[null,null,30,"…",null,null,null,null,null,null,null,null,null,null,0,0,0,0,0,null,"","","","",""]
[null,null,null,"REVUE DE PROJET - Réalisation",null,"x",null,null,"SUPPORT d'EVALUATION :","OUI",null,null,null,null,0,0,0,0,0,null,{"$f":"IF($J137=\"OUI\",$D137,\"\")","v":"REVUE DE PROJET - Réalisation"},{"$f":"IF($J137=\"OUI\",$D137,\"\")","v":"REVUE DE PROJET - Réalisation"},{"$f":"IF($J137=\"OUI\",$D137,\"\")","v":"REVUE DE PROJET - Réalisation"},{"$f":"IF($J137=\"OUI\",$D137,\"\")","v":"REVUE DE PROJET - Réalisation"},{"$f":"IF($J137=\"OUI\",$D137,\"\")","v":"REVUE DE PROJET - Réalisation"}]
[null,null,null,"QUALIFICATION - INTEGRATION - VALIDATION",null,null,null,null,"Nombre de lignes à afficher :",null,null,null,null,7,0,0,0,0,0,null,"","","","",""]
[null,null,1,"Validation du fonctionnement de la prise USB sur un téléphone",4,"x",null,null,null,null,null,null,null,null,4,0,0,0,0,null,"Validation du fonctionnement de la prise USB sur un téléphone","","","",""]
[null,null,2,"Validation du fonctionnement de la prise électrique 230 V",4,null,null,"x",null,null,null,null,null,null,0,0,4,0,0,null,"","","Validation du fonctionnement de la prise électrique 230 V","",""]
[null,null,3,"Validation du fonctionnement du réseau WIFI sur un PC",7,null,"x",null,null,null,null,null,null,null,{"$f":"IF(F141=\"x\",$E141,0)","v":0},{"$f":"IF(G141=\"x\",$E141,0)","v":7},{"$f":"IF(H141=\"x\",$E141,0)","v":0},{"$f":"IF(I141=\"x\",$E141,0)","v":0},0,null,{"$f":"IF(F141=\"x\",$D141,\"\")","v":""},{"$f":"IF(G141=\"x\",$D141,\"\")","v":"Validation du fonctionnement du réseau WIFI sur un PC"},{"$f":"IF(H141=\"x\",$D141,\"\")","v":""},{"$f":"IF(I141=\"x\",$D141,\"\")","v":""},{"$f":"IF(J141=\"x\",$D141,\"\")","v":""}]
[null,null,4,"Valider le rechargement d' un  téléphone à partir de la génératrice",4,"x",null,null,null,null,null,null,null,null,4,0,0,0,0,null,"Valider le rechargement d' un  téléphone à partir de la génératrice","","","",""]
[null,null,5,"Définir le protocole d' essai ",3,"x",null,"x",null,null,null,null,null,null,3,0,3,0,0,null,"Définir le protocole d' essai ","","Définir le protocole d' essai ","",""]
[null,null,6,"Piloter le projet ( communiquer … )",4,"x","x","x",null,null,null,null,null,null,4,4,4,0,0,null,"Piloter le projet ( communiquer … )","Piloter le projet ( communiquer … )","Piloter le projet ( communiquer … )","",""]
[null,null,7,"Validation des performances / remedier ",3,"x","x","x",null,null,null,null,null,null,3,3,3,0,0,null,"Validation des performances / remedier ","Validation des performances / remedier ","Validation des performances / remedier ","",""]
[null,null,8,"…",null,null,null,null,null,null,null,null,null,null,0,0,0,0,0,null,"","","","",""]
[null,null,9,"…",null,null,null,null,null,null,null,null,null,null,0,0,0,0,0,null,"","","","",""]
[null,null,10,"…",null,null,null,null,null,null,null,null,null,null,0,0,0,0,0,null,"","","","",""]
[null,null,11,"…",null,null,null,null,null,null,null,null,null,null,0,0,0,0,0,null,"","","","",""]
[null,null,12,"…",null,null,null,null,null,null,null,null,null,null,0,0,0,0,0,null,"","","","",""]
[null,null,13,"…",null,null,null,null,null,null,null,null,null,null,0,0,0,0,0,null,"","","","",""]
[null,null,14,"…",null,null,null,null,null,null,null,null,null,null,0,0,0,0,0,null,"","","","",""]
[null,null,15,"…",null,null,null,null,null,null,null,null,null,null,0,0,0,0,0,null,"","","","",""]
[null,null,16,"…",null,null,null,null,null,null,null,null,null,null,0,0,0,0,0,null,"","","","",""]
[null,null,17,"…",null,null,null,null,null,null,null,null,null,null,0,0,0,0,{"$f":"IF(J155=\"x\",$E155,0)","v":0},null,"","","","",""]
[null,null,18,"…",null,null,null,null,null,null,null,null,null,null,0,0,0,0,0,null,"","","","",""]
[null,null,19,"…",null,null,null,null,null,null,null,null,null,null,0,0,0,0,0,null,"","","","",""]
[null,null,20,"…",null,null,null,null,null,null,null,null,null,null,0,0,0,0,0,null,"","","","",""]
[null,null,21,"…",null,null,null,null,null,null,null,null,null,null,0,0,0,0,0,null,"","","","",""]
[null,null,22,"…",null,null,null,null,null,null,null,null,null,null,0,0,0,0,0,null,"","","","",""]
[null,null,23,"…",null,null,null,null,null,null,null,null,null,null,0,0,0,0,0,null,"","","","",""]
[null,null,24,"…",null,null,null,null,null,null,null,null,null,null,0,0,0,0,0,null,"","","","",""]
[null,null,25,"…",null,null,null,null,null,null,null,null,null,null,0,0,0,0,0,null,"","","","",""]
[null,null,26,"…",null,null,null,null,null,null,null,null,null,null,0,0,0,0,0,null,"","","","",""]
[null,null,27,"…",null,null,null,null,null,null,null,null,null,null,0,0,0,0,0,null,"","","","",""]
[null,null,28,"…",null,null,null,null,null,null,null,null,null,null,0,0,0,0,0,null,{"$f":"IF(F166=\"x\",$D166,\"\")","v":""},"","","",""]
[null,null,29,"…",null,null,null,null,null,null,null,null,null,null,0,0,0,0,0,null,"","","","",""]
[null,null,30,"…",null,null,null,null,null,null,null,null,null,null,0,0,0,0,0,null,"","","","",""]
[null,null,null,"REVUE DE PROJET - Validation",null,"x",null,null,"SUPPORT d'EVALUATION :","OUI",null,null,null,null,0,0,0,0,0,null,{"$f":"IF($J169=\"OUI\",$D169,\"\")","v":"REVUE DE PROJET - Validation"},{"$f":"IF($J169=\"OUI\",$D169,\"\")","v":"REVUE DE PROJET - Validation"},"REVUE DE PROJET - Validation","REVUE DE PROJET - Validation","REVUE DE PROJET - Validation"]
[null,null,null,"SOUTENANCE FINALE DU PROJET",null,null,null,null,"SUPPORT d'EVALUATION :","OUI",null,null,null,null,0,0,0,0,0,null,{"$f":"IF($J170=\"OUI\",$D170,\"\")","v":"SOUTENANCE FINALE DU PROJET"},"SOUTENANCE FINALE DU PROJET","SOUTENANCE FINALE DU PROJET","SOUTENANCE FINALE DU PROJET","SOUTENANCE FINALE DU PROJET"]

{"sheet":"Elève A","index":3,"n_rows":97,"n_cols":180,"rows_kept":97,"cut":false,"hidden":false,"merged":[]}
[null,{"$f":"parametres!G2","v":4},null,true,null,null,"IR_t","IR_e","IS_t","IS_e",null,null,{"$f":"CONCATENATE(\"A : \",Synthèse!E21,\" \",Synthèse!F21)","v":"A : eleve A "},null,null,{"$f":"IF($B$2<>0,H2/G2,\"X\")","v":0.85106382978723405},{"$f":"IF($B$2<>0,J2/I2,\"X\")","v":0.51515151515151514},{"$f":"IF($B$2<>0,(H2+J2)/(G2+I2),0)","v":0.71250000000000002},null,{"$f":"TRANSPOSE('Déclinaison projet'!U10:U170)","v":""},"Compléter l’analyse fonctionnelle du système existant","Compléter l’analyse fonctionnelle du système modifié","Compléter le diagramme d’organisation des tâches (WBS)","Compléter le planning et le faire vivre ( diagramme de GANTT)","S'approprier le CDCF ( avec le client éventuellement )","Structurer le travail de groupe ( identifier les découpages possibles)","","","","","","","","","","","","","","","","","","","","","","","","","","","Analyse de la chaine d'énergie du système Fitlux","Evaluer la prodcution d'énergie de la génératrice","","Proposer un système de stokage","","Evaluer la production d'énergie de 10 m² de panneaux","Déterminer les caractéristique d'une prise USB","","","","","","","","","","","","","","","","","","","","","","","","REVUE DE PROJET - Conception préliminaire","","Détermination du schéma de circuit de puissance et de commande","","","","Déterminer l'interface entre la génératrice et la prise USB par un modèle de simulation sur PROTEUS","","Chiffrer le projet par un devis","Préparer le bon de commande des matériels","","","","","","","","","","","","","","","","","","","","","","","REVUE DE PROJET - Conception détaillée","","","","","","","Créer une struture du prototype","Câblage de La prise USB et de l'interface","Esthétique du prototype","","","","","","","","","","","","","","","","","","","","","","","REVUE DE PROJET - Réalisation","","Validation du fonctionnement de la prise USB sur un téléphone","","","Valider le rechargement d' un  téléphone à partir de la génératrice","Définir le protocole d' essai ","Piloter le projet ( communiquer … )","Validation des performances / remedier ","","","","","","","","","","","","","","","","","","","","","","","","REVUE DE PROJET - Validation","SOUTENANCE FINALE DU PROJET"]
[null,{"$f":"SUM(B4:B94)","v":80},null,true,null,null,{"$f":"SUM(G4:G94)","v":47},{"$f":"SUM(H4:H94)","v":40},{"$f":"SUM(I4:I94)","v":33},{"$f":"SUM(J4:J94)","v":17},null,null,null,null,null,"Tx Indic. REVUES","Tx Indic. SOUTEN.","Taux Global"]
[]
[null,null,null,{"$f":"IF($B$1>2,TRUE,FALSE)","v":true},null,null,null,null,null,null,null,null,"O1 -  Caractériser des systèmes privilégiant un usage raisonné du point de vue développement durable"]
[null,{"$f":"N5*D5","v":5},{"$f":"IF(FX5=\"OK\",N5,0)","v":5},true,null,null,{"$f":"IF($FX5=\"\",$B5,0)","v":0},{"$f":"IF(OR($AY5=\"OK\",$CE5=\"OK\",$DK5=\"OK\",$EQ5=\"OK\",$FW5=\"OK\"),$B5,0)","v":0},{"$f":"IF($FX5=\"\",0,$B5)","v":5},{"$f":"IF($FX5=\"OK\",$B5,0)","v":5},null,null,"CO1.1. Justifier les choix des matériaux, des structures d’un système et les énergies mises en oeuvre dans une approche de développement durable",5,null,null,null,null,null,null,null,null,null,null,null,null,null,null,null,null,null,null,null,null,null,null,null,null,null,null,null,null,null,null,null,null,null,null,null,null,">",null,null,null,null,null,null,null,null,null,null,null,null,null,null,null,null,null,null,null,null,null,null,null,null,null,null,null,null,null,null,null,">",null,null,null,null,null,null,null,null,null,null,null,null,null,null,null,null,null,null,null,null,null,null,null,null,null,null,null,null,null,null,null,">",null,null,null,null,null,null,null,null,null,null,null,null,null,null,null,null,null,null,null,null,null,null,null,null,null,null,null,null,null,null,null,">",null,"x",null,null,null,null,null,null,null,null,null,null,null,null,null,null,null,null,null,null,null,null,null,null,null,null,null,null,null,null,null,">",{"$f":"IF(COUNTA(U5:FW5)>5,\"OK\",\"N/E\")","v":"OK"}]
[null,{"$f":"N6*D6","v":3},{"$f":"IF(FX6=\"OK\",N6,0)","v":0},true,null,null,{"$f":"IF($FX6=\"\",$B6,0)","v":0},{"$f":"IF(OR($AY6=\"OK\",$CE6=\"OK\",$DK6=\"OK\",$EQ6=\"OK\",$FW6=\"OK\"),$B6,0)","v":0},{"$f":"IF($FX6=\"\",0,$B6)","v":3},{"$f":"IF($FX6=\"OK\",$B6,0)","v":0},null,null,"CO1.2. Justifier le choix d’une solution selon des contraintes d’ergonomie et d’effets sur la santé de l’homme et du vivant",3,null,null,null,null,null,null,null,null,null,null,null,null,null,null,null,null,null,null,null,null,null,null,null,null,null,null,null,null,null,null,null,null,null,null,null,null,">",null,null,null,null,null,null,null,null,null,null,null,null,null,null,null,null,null,null,null,null,null,null,null,null,null,null,null,null,null,null,null,">",null,null,null,null,null,null,null,null,null,null,null,null,null,null,null,null,null,null,null,null,null,null,null,null,null,null,null,null,null,null,null,">",null,null,null,null,null,null,null,null,null,null,null,null,null,null,null,null,null,null,null,null,null,null,null,null,null,null,null,null,null,null,null,">",null,null,null,null,null,null,null,null,null,null,null,null,null,null,null,null,null,null,null,null,null,null,null,null,null,null,null,null,null,null,null,">",{"$f":"IF(COUNTA(U6:FW6)>5,\"OK\",\"N/E\")","v":"N/E"}]
[null,null,null,true,null,null,null,null,null,null,null,null,"O2 - Identifier les éléments permettant la limitation de l’Impact environnemental d’un système et de ses constituants"]
[null,4,{"$f":"IF(FX8=\"OK\",N8,0)","v":4},true,null,null,0,0,4,4,null,null,"CO2.1. Identifier les flux et la forme de l’énergie, caractériser ses transformations et/ou modulations et estimer l’efficacité énergétique globale d’un système",4,null,null,null,null,null,null,null,null,null,null,null,null,null,null,null,null,null,null,null,null,null,null,null,null,null,null,null,null,null,null,null,null,null,null,null,null,">",null,null,null,null,null,null,null,null,null,null,null,null,null,null,null,null,null,null,null,null,null,null,null,null,null,null,null,null,null,null,null,">",null,null,null,null,null,null,null,null,null,null,null,null,null,null,null,null,null,null,null,null,null,null,null,null,null,null,null,null,null,null,null,">",null,null,null,null,null,null,null,null,null,null,null,null,null,null,null,null,null,null,null,null,null,null,null,null,null,null,null,null,null,null,null,">",null,"x",null,null,null,null,null,null,null,null,null,null,null,null,null,null,null,null,null,null,null,null,null,null,null,null,null,null,null,null,null,">",{"$f":"IF(COUNTA(U8:FW8)>5,\"OK\",\"N/E\")","v":"OK"}]
[null,5,{"$f":"IF(FX9=\"OK\",N9,0)","v":0},true,null,null,0,0,5,0,null,null,"CO2.2. Justifier les solutions constructives d’un système au regard des impacts environnementaux et économiques engendrés tout au long de son cycle de vie",5,null,null,null,null,null,null,null,null,null,null,null,null,null,null,null,null,null,null,null,null,null,null,null,null,null,null,null,null,null,null,null,null,null,null,null,null,">",null,null,null,null,null,null,null,null,null,null,null,null,null,null,null,null,null,null,null,null,null,null,null,null,null,null,null,null,null,null,null,">",null,null,null,null,null,null,null,null,null,null,null,null,null,null,null,null,null,null,null,null,null,null,null,null,null,null,null,null,null,null,null,">",null,null,null,null,null,null,null,null,null,null,null,null,null,null,null,null,null,null,null,null,null,null,null,null,null,null,null,null,null,null,null,">",null,null,null,null,null,null,null,null,null,null,null,null,null,null,null,null,null,null,null,null,null,null,null,null,null,null,null,null,null,null,null,">",{"$f":"IF(COUNTA(U9:FW9)>5,\"OK\",\"N/E\")","v":"N/E"}]
[null,null,null,true,null,null,null,null,null,null,null,null,"O6 - Communiquer une idée, un principe ou une solution technique, un projet, y compris en langue étrangère"]
[null,3,{"$f":"IF(FX11=\"OK\",N11,0)","v":3},true,null,null,0,0,3,3,null,null,"CO6.1. Décrire une idée, un principe, une solution, un projet en utilisant des outils de représentation adaptés",3,null,null,null,null,null,null,null,null,null,null,null,null,null,null,null,null,null,null,null,null,null,null,null,null,null,null,null,null,null,null,null,null,null,null,null,null,">",null,null,null,null,null,null,null,null,null,null,null,null,null,null,null,null,null,null,null,null,null,null,null,null,null,null,null,null,null,null,null,">",null,"x",null,null,null,null,null,null,null,null,null,null,null,null,null,null,null,null,null,null,null,null,null,null,null,null,null,null,null,null,null,">",null,null,null,null,null,null,null,null,null,null,null,null,null,null,null,null,null,null,null,null,null,null,null,null,null,null,null,null,null,null,null,">",null,null,null,null,null,null,null,null,null,null,null,null,null,null,null,null,null,null,null,null,null,null,null,null,null,null,null,null,null,null,null,">",{"$f":"IF(COUNTA(U11:FW11)>5,\"OK\",\"N/E\")","v":"OK"}]
[null,3,{"$f":"IF(FX12=\"OK\",N12,0)","v":0},true,null,null,0,0,3,0,null,null,"CO6.2. Décrire le fonctionnement et/ou l’exploitation d’un système en utilisant l'outil de description le plus pertinent",3,null,null,null,null,null,null,null,null,null,null,null,null,null,null,null,null,null,null,null,null,null,null,null,null,null,null,null,null,null,null,null,null,null,null,null,null,">",null,null,null,null,null,null,null,null,null,null,null,null,null,null,null,null,null,null,null,null,null,null,null,null,null,null,null,null,null,null,null,">",null,null,null,null,null,null,null,null,null,null,null,null,null,null,null,null,null,null,null,null,null,null,null,null,null,null,null,null,null,null,null,">",null,null,null,null,null,null,null,null,null,null,null,null,null,null,null,null,null,null,null,null,null,null,null,null,null,null,null,null,null,null,null,">",null,null,null,null,null,null,null,null,null,null,null,null,null,null,null,null,null,null,null,null,null,null,null,null,null,null,null,null,null,null,null,">",{"$f":"IF(COUNTA(U12:FW12)>5,\"OK\",\"N/E\")","v":"N/E"}]
[null,5,{"$f":"IF(FX13=\"OK\",N13,0)","v":5},true,null,null,0,0,5,5,null,null,"CO6.3. Présenter et argumenter des démarches, des résultats, y compris dans une langue étrangère",5,null,null,null,null,null,null,null,null,null,null,null,null,null,null,null,null,null,null,null,null,null,null,null,null,null,null,null,null,null,null,null,null,null,null,null,null,">",null,null,null,null,null,null,null,null,null,null,null,null,null,null,null,null,null,null,null,null,null,null,null,null,null,null,null,null,null,null,null,">",null,null,null,null,null,null,null,null,null,null,null,null,null,null,null,null,null,null,null,null,null,null,null,null,null,null,null,null,null,null,null,">",null,null,null,null,null,null,null,null,null,null,null,null,null,null,null,null,null,null,null,null,null,null,null,null,null,null,null,null,null,null,null,">",null,"x",null,null,null,null,null,null,null,null,null,null,null,null,null,null,null,null,null,null,null,null,null,null,null,null,null,null,null,null,null,">",{"$f":"IF(COUNTA(U13:FW13)>5,\"OK\",\"N/E\")","v":"OK"}]
[null,null,null,true,null,null,null,null,null,null,null,null,"O7 -  Imaginer une solution, répondre à un besoin"]
[null,0,{"$f":"IF(OR(CE15=\"OK\",EQ15=\"OK\"),N15,0)","v":0},{"$f":"IF($B$1=3,TRUE,FALSE)","v":false},null,null,0,0,0,0,null,null,"CO7.ac1. Participer à une étude architecturale, dans une démarche de développement durable",5,null,null,null,null,null,null,null,null,null,null,null,null,null,null,null,null,null,null,null,null,null,null,null,null,null,null,null,null,null,null,null,null,null,null,null,null,{"$f":"IF(AND(AY$1<>\"\",COUNTA(U15:AX15)>0),\"OK\",\"N/E\")","v":"N/E"},null,null,null,null,null,null,null,null,null,null,null,null,null,null,null,null,null,null,null,null,null,null,null,null,null,null,null,null,null,null,null,{"$f":"IF(AND(CE$1<>\"\",COUNTA(U15:CD15)>1),\"OK\",\"N/E\")","v":"N/E"},null,null,null,null,null,null,null,null,null,null,null,null,null,null,null,null,null,null,null,null,null,null,null,null,null,null,null,null,null,null,null,{"$f":"IF(AND(DK$1<>\"\",COUNTA(U15:DJ15)>2),\"OK\",\"N/E\")","v":"N/E"},null,null,null,null,null,null,null,null,null,null,null,null,null,null,null,null,null,null,null,null,null,null,null,null,null,null,null,null,null,null,null,{"$f":"IF(AND(EQ$1<>\"\",COUNTA(U15:EP15)>3),\"OK\",\"N/E\")","v":"N/E"},null,null,null,null,null,null,null,null,null,null,null,null,null,null,null,null,null,null,null,null,null,null,null,null,null,null,null,null,null,null,null,{"$f":"IF(AND(FW$1<>\"\",COUNTA(U15:FV15)>4),\"OK\",\"N/E\")","v":"N/E"}]
[null,0,0,{"$f":"IF($B$1=3,TRUE,FALSE)","v":false},null,null,0,0,0,0,null,null,"CO7.ac2. Proposer/choisir des solutions techniques répondant aux contraintes et attentes d’une construction",7,null,null,null,null,null,null,null,null,null,null,null,null,null,null,null,null,null,null,null,null,null,null,null,null,null,null,null,null,null,null,null,null,null,null,null,null,{"$f":"IF(AND(AY$1<>\"\",COUNTA(U16:AX16)>0),\"OK\",\"N/E\")","v":"N/E"},null,null,null,null,null,null,null,null,null,null,null,null,null,null,null,null,null,null,null,null,null,null,null,null,null,null,null,null,null,null,null,{"$f":"IF(AND(CE$1<>\"\",COUNTA(U16:CD16)>1),\"OK\",\"N/E\")","v":"N/E"},null,null,null,null,null,null,null,null,null,null,null,null,null,null,null,null,null,null,null,null,null,null,null,null,null,null,null,null,null,null,null,{"$f":"IF(AND(DK$1<>\"\",COUNTA(U16:DJ16)>2),\"OK\",\"N/E\")","v":"N/E"},null,null,null,null,null,null,null,null,null,null,null,null,null,null,null,null,null,null,null,null,null,null,null,null,null,null,null,null,null,null,null,{"$f":"IF(AND(EQ$1<>\"\",COUNTA(U16:EP16)>3),\"OK\",\"N/E\")","v":"N/E"},null,null,null,null,null,null,null,null,null,null,null,null,null,null,null,null,null,null,null,null,null,null,null,null,null,null,null,null,null,null,null,{"$f":"IF(AND(FW$1<>\"\",COUNTA(U16:FV16)>4),\"OK\",\"N/E\")","v":"N/E"}]
[null,0,0,{"$f":"IF($B$1=3,TRUE,FALSE)","v":false},null,null,0,0,0,0,null,null,"CO7.ac3. Concevoir une organisation de réalisation",4,null,null,null,null,null,null,null,null,null,null,null,null,null,null,null,null,null,null,null,null,null,null,null,null,null,null,null,null,null,null,null,null,null,null,null,null,"N/E",null,null,null,null,null,null,null,null,null,null,null,null,null,null,null,null,null,null,null,null,null,null,null,null,null,null,null,null,null,null,null,"N/E",null,null,null,null,null,null,null,null,null,null,null,null,null,null,null,null,null,null,null,null,null,null,null,null,null,null,null,null,null,null,null,"N/E",null,null,null,null,null,null,null,null,null,null,null,null,null,null,null,null,null,null,null,null,null,null,null,null,null,null,null,null,null,null,null,"N/E",null,null,null,null,null,null,null,null,null,null,null,null,null,null,null,null,null,null,null,null,null,null,null,null,null,null,null,null,null,null,null,"N/E"]
[null,7,7,{"$f":"IF($B$1=4,TRUE,FALSE)","v":true},null,null,7,7,0,0,null,null,"CO7.ee1. Participer à une démarche de conception dans le but de proposer plusieurs solutions possibles à un problème technique identifié en lien avec un enjeu énergétique",7,null,null,null,null,null,null,null,null,null,null,null,null,null,null,null,null,null,null,null,null,null,null,null,null,null,null,null,null,null,null,null,null,null,null,null,null,"N/E",null,null,"x",null,"x",null,null,null,null,null,null,null,null,null,null,null,null,null,null,null,null,null,null,null,null,null,null,null,null,null,null,"OK",null,null,null,null,null,null,null,null,null,null,null,null,null,null,null,null,null,null,null,null,null,null,null,null,null,null,null,null,null,null,null,"OK",null,null,null,null,null,null,null,null,null,null,null,null,null,null,null,null,null,null,null,null,null,null,null,null,null,null,null,null,null,null,null,"OK",null,null,null,null,null,null,null,null,null,null,null,null,null,null,null,null,null,null,null,null,null,null,null,null,null,null,null,null,null,null,null,"OK"]
[null,6,6,{"$f":"IF($B$1=4,TRUE,FALSE)","v":true},null,null,6,6,0,0,null,null,"CO7.ee2. Justifier une solution retenue en intégrant les conséquences des choix sur le triptyque matériau-énergie-information",6,null,null,null,null,null,null,null,null,null,null,null,null,null,null,null,null,null,null,null,null,null,null,null,null,null,null,null,null,null,null,null,null,null,null,null,null,"N/E",null,"x","x",null,"x",null,null,null,null,null,null,null,null,null,null,null,null,null,null,null,null,null,null,null,null,null,null,null,null,null,null,"OK",null,"x",null,null,null,null,null,null,null,null,null,null,null,null,null,null,null,null,null,null,null,null,null,null,null,null,null,null,null,null,null,"OK",null,null,null,null,null,null,null,null,null,null,null,null,null,null,null,null,null,null,null,null,null,null,null,null,null,null,null,null,null,null,null,"OK",null,null,null,null,null,null,null,null,null,null,null,null,null,null,null,null,null,null,null,null,null,null,null,null,null,null,null,null,null,null,null,"OK"]
[null,4,4,{"$f":"IF($B$1=4,TRUE,FALSE)","v":true},null,null,4,4,0,0,null,null,"CO7.ee3. Définir la structure, la constitution d’un système en fonction des caractéristiques technico-économiques et environnementales attendues",4,null,null,null,null,null,null,null,null,null,null,null,null,null,null,null,null,null,null,null,null,null,null,null,null,null,null,null,null,null,null,null,null,null,null,null,null,"N/E",null,null,"x",null,"x",null,null,null,null,null,null,null,null,null,null,null,null,null,null,null,null,null,null,null,null,null,null,null,null,null,null,"OK",null,"x",null,null,null,null,null,null,null,null,null,null,null,null,null,null,null,null,null,null,null,null,null,null,null,null,null,null,null,null,null,"OK",null,null,null,null,null,null,null,null,null,null,null,null,null,null,null,null,null,null,null,null,null,null,null,null,null,null,null,null,null,null,null,"OK",null,null,null,null,null,null,null,null,null,null,null,null,null,null,null,null,null,null,null,null,null,null,null,null,null,null,null,null,null,null,null,"OK"]
[null,4,4,{"$f":"IF($B$1=4,TRUE,FALSE)","v":true},null,null,4,4,0,0,null,null,"CO7.ee4. Définir les modifications de la structure, les choix de constituants et du type de système de gestion d'une chaîne d’énergie afin de répondre à une évolution d’un cahier des charges",4,null,null,null,null,null,null,null,null,null,null,null,null,null,null,null,null,null,null,null,null,null,null,null,null,null,null,null,null,null,null,null,null,null,null,null,null,"N/E",null,null,"x",null,"x",null,null,null,null,null,null,null,null,null,null,null,null,null,null,null,null,null,null,null,null,null,null,null,null,null,null,"OK",null,"x",null,null,null,null,null,null,null,null,null,null,null,null,null,null,null,null,null,null,null,null,null,null,null,null,null,null,null,null,null,"OK",null,null,null,null,null,null,null,null,null,null,null,null,null,null,null,null,null,null,null,null,null,null,null,null,null,null,null,null,null,null,null,"OK",null,null,null,null,null,null,null,null,null,null,null,null,null,null,null,null,null,null,null,null,null,null,null,null,null,null,null,null,null,null,null,"OK"]
[null,0,0,{"$f":"IF($B$1=5,TRUE,FALSE)","v":false},null,null,0,0,0,0,null,null,"CO7.itec1. Identifier et justifier un problème technique à partir de l’analyse globale d’un système (approche matière-énergie-information)",5,null,null,null,null,null,null,null,null,null,null,null,null,null,null,null,null,null,null,null,null,null,null,null,null,null,null,null,null,null,null,null,null,null,null,null,null,"N/E",null,null,null,null,null,null,null,null,null,null,null,null,null,null,null,null,null,null,null,null,null,null,null,null,null,null,null,null,null,null,null,"N/E",null,null,null,null,null,null,null,null,null,null,null,null,null,null,null,null,null,null,null,null,null,null,null,null,null,null,null,null,null,null,null,"N/E",null,null,null,null,null,null,null,null,null,null,null,null,null,null,null,null,null,null,null,null,null,null,null,null,null,null,null,null,null,null,null,"N/E",null,null,null,null,null,null,null,null,null,null,null,null,null,null,null,null,null,null,null,null,null,null,null,null,null,null,null,null,null,null,null,"N/E"]
[null,0,0,{"$f":"IF($B$1=5,TRUE,FALSE)","v":false},null,null,0,0,0,0,null,null,"CO7.itec2. Proposer des solutions à un problème technique identifié en participant à des démarches de créativité, choisir et justifier la solution retenue",6,null,null,null,null,null,null,null,null,null,null,null,null,null,null,null,null,null,null,null,null,null,null,null,null,null,null,null,null,null,null,null,null,null,null,null,null,"N/E",null,null,null,null,null,null,null,null,null,null,null,null,null,null,null,null,null,null,null,null,null,null,null,null,null,null,null,null,null,null,null,"N/E",null,null,null,null,null,null,null,null,null,null,null,null,null,null,null,null,null,null,null,null,null,null,null,null,null,null,null,null,null,null,null,"N/E",null,null,null,null,null,null,null,null,null,null,null,null,null,null,null,null,null,null,null,null,null,null,null,null,null,null,null,null,null,null,null,"N/E",null,null,null,null,null,null,null,null,null,null,null,null,null,null,null,null,null,null,null,null,null,null,null,null,null,null,null,null,null,null,null,"N/E"]
[null,0,0,{"$f":"IF($B$1=5,TRUE,FALSE)","v":false},null,null,0,0,0,0,null,null,"CO7.itec3. Définir, à l’aide d’un modeleur numérique, les formes et dimensions d'une pièce d'un mécanisme à partir des contraintes fonctionnelles, de son principe de réalisation et de son matériau",3,null,null,null,null,null,null,null,null,null,null,null,null,null,null,null,null,null,null,null,null,null,null,null,null,null,null,null,null,null,null,null,null,null,null,null,null,"N/E",null,null,null,null,null,null,null,null,null,null,null,null,null,null,null,null,null,null,null,null,null,null,null,null,null,null,null,null,null,null,null,"N/E",null,null,null,null,null,null,null,null,null,null,null,null,null,null,null,null,null,null,null,null,null,null,null,null,null,null,null,null,null,null,null,"N/E",null,null,null,null,null,null,null,null,null,null,null,null,null,null,null,null,null,null,null,null,null,null,null,null,null,null,null,null,null,null,null,"N/E",null,null,null,null,null,null,null,null,null,null,null,null,null,null,null,null,null,null,null,null,null,null,null,null,null,null,null,null,null,null,null,"N/E"]
[null,0,0,{"$f":"IF($B$1=5,TRUE,FALSE)","v":false},null,null,0,0,0,0,null,null,"CO7.itec4. Définir, à l’aide d’un modeleur numérique, les modifications d'un mécanisme à partir des contraintes fonctionnelles",2,null,null,null,null,null,null,null,null,null,null,null,null,null,null,null,null,null,null,null,null,null,null,null,null,null,null,null,null,null,null,null,null,null,null,null,null,"N/E",null,null,null,null,null,null,null,null,null,null,null,null,null,null,null,null,null,null,null,null,null,null,null,null,null,null,null,null,null,null,null,"N/E",null,null,null,null,null,null,null,null,null,null,null,null,null,null,null,null,null,null,null,null,null,null,null,null,null,null,null,null,null,null,null,"N/E",null,null,null,null,null,null,null,null,null,null,null,null,null,null,null,null,null,null,null,null,null,null,null,null,null,null,null,null,null,null,null,"N/E",null,null,null,null,null,null,null,null,null,null,null,null,null,null,null,null,null,null,null,null,null,null,null,null,null,null,null,null,null,null,null,"N/E"]
[null,0,0,{"$f":"IF($B$1=6,TRUE,FALSE)","v":false},null,null,0,0,0,0,null,null,"CO7.sin1. Décoder la notice technique d’un système, vérifier la conformité du fonctionnement",4,null,null,null,null,null,null,null,null,null,null,null,null,null,null,null,null,null,null,null,null,null,null,null,null,null,null,null,null,null,null,null,null,null,null,null,null,"N/E",null,null,null,null,null,null,null,null,null,null,null,null,null,null,null,null,null,null,null,null,null,null,null,null,null,null,null,null,null,null,null,"N/E",null,null,null,null,null,null,null,null,null,null,null,null,null,null,null,null,null,null,null,null,null,null,null,null,null,null,null,null,null,null,null,"N/E",null,null,null,null,null,null,null,null,null,null,null,null,null,null,null,null,null,null,null,null,null,null,null,null,null,null,null,null,null,null,null,"N/E",null,null,null,null,null,null,null,null,null,null,null,null,null,null,null,null,null,null,null,null,null,null,null,null,null,null,null,null,null,null,null,"N/E"]
[null,0,0,{"$f":"IF($B$1=6,TRUE,FALSE)","v":false},null,null,0,0,0,0,null,null,"CO7.sin2. Décoder le cahier des charges fonctionnel décrivant le besoin exprimé, identifier la fonction définie par un besoin exprimé, faire des mesures pour caractériser cette fonction et conclure sur sa conformité",5,null,null,null,null,null,null,null,null,null,null,null,null,null,null,null,null,null,null,null,null,null,null,null,null,null,null,null,null,null,null,null,null,null,null,null,null,"N/E",null,null,null,null,null,null,null,null,null,null,null,null,null,null,null,null,null,null,null,null,null,null,null,null,null,null,null,null,null,null,null,"N/E",null,null,null,null,null,null,null,null,null,null,null,null,null,null,null,null,null,null,null,null,null,null,null,null,null,null,null,null,null,null,null,"N/E",null,null,null,null,null,null,null,null,null,null,null,null,null,null,null,null,null,null,null,null,null,null,null,null,null,null,null,null,null,null,null,"N/E",null,null,null,null,null,null,null,null,null,null,null,null,null,null,null,null,null,null,null,null,null,null,null,null,null,null,null,null,null,null,null,"N/E"]
[null,0,0,{"$f":"IF($B$1=6,TRUE,FALSE)","v":false},null,null,0,0,0,0,null,null,"CO7.sin3. Exprimer le principe de fonctionnement d’un système à partir des diagrammes SysML pertinents Repérer les constituants de la chaîne d’énergie et d’information",4,null,null,null,null,null,null,null,null,null,null,null,null,null,null,null,null,null,null,null,null,null,null,null,null,null,null,null,null,null,null,null,null,null,null,null,null,"N/E",null,null,null,null,null,null,null,null,null,null,null,null,null,null,null,null,null,null,null,null,null,null,null,null,null,null,null,null,null,null,null,"N/E",null,null,null,null,null,null,null,null,null,null,null,null,null,null,null,null,null,null,null,null,null,null,null,null,null,null,null,null,null,null,null,"N/E",null,null,null,null,null,null,null,null,null,null,null,null,null,null,null,null,null,null,null,null,null,null,null,null,null,null,null,null,null,null,null,"N/E",null,null,null,null,null,null,null,null,null,null,null,null,null,null,null,null,null,null,null,null,null,null,null,null,null,null,null,null,null,null,null,"N/E"]
[null,null,null,{"$f":"IF($B$1>2,TRUE,FALSE)","v":true},null,null,null,null,null,null,null,null,"O8 -Valider des solutions techniques"]
[null,0,{"$f":"IF(OR(CE30=\"OK\",EQ30=\"OK\"),N30,0)","v":0},{"$f":"IF($B$1=3,TRUE,FALSE)","v":false},null,null,0,0,0,0,null,null,"CO8.ac1. Simuler un comportement structurel, thermique et acoustique de tout ou partie d’une construction",4,null,null,null,null,null,null,null,null,null,null,null,null,null,null,null,null,null,null,null,null,null,null,null,null,null,null,null,null,null,null,null,null,null,null,null,null,{"$f":"IF(AND(AY$1<>\"\",COUNTA(U30:AX30)>0),\"OK\",\"N/E\")","v":"N/E"},null,null,null,null,null,null,null,null,null,null,null,null,null,null,null,null,null,null,null,null,null,null,null,null,null,null,null,null,null,null,null,{"$f":"IF(AND(CE$1<>\"\",COUNTA(U30:CD30)>1),\"OK\",\"N/E\")","v":"N/E"},null,null,null,null,null,null,null,null,null,null,null,null,null,null,null,null,null,null,null,null,null,null,null,null,null,null,null,null,null,null,null,{"$f":"IF(AND(DK$1<>\"\",COUNTA(U30:DJ30)>2),\"OK\",\"N/E\")","v":"N/E"},null,null,null,null,null,null,null,null,null,null,null,null,null,null,null,null,null,null,null,null,null,null,null,null,null,null,null,null,null,null,null,{"$f":"IF(AND(EQ$1<>\"\",COUNTA(U30:EP30)>3),\"OK\",\"N/E\")","v":"N/E"},null,null,null,null,null,null,null,null,null,null,null,null,null,null,null,null,null,null,null,null,null,null,null,null,null,null,null,null,null,null,null,{"$f":"IF(AND(FW$1<>\"\",COUNTA(U30:FV30)>4),\"OK\",\"N/E\")","v":"N/E"}]
[null,0,0,{"$f":"IF($B$1=3,TRUE,FALSE)","v":false},null,null,0,0,0,0,null,null,"CO8.ac2. Analyser les résultats issus de simulations ou d’essais de laboratoire",4,null,null,null,null,null,null,null,null,null,null,null,null,null,null,null,null,null,null,null,null,null,null,null,null,null,null,null,null,null,null,null,null,null,null,null,null,"N/E",null,null,null,null,null,null,null,null,null,null,null,null,null,null,null,null,null,null,null,null,null,null,null,null,null,null,null,null,null,null,null,"N/E",null,null,null,null,null,null,null,null,null,null,null,null,null,null,null,null,null,null,null,null,null,null,null,null,null,null,null,null,null,null,null,"N/E",null,null,null,null,null,null,null,null,null,null,null,null,null,null,null,null,null,null,null,null,null,null,null,null,null,null,null,null,null,null,null,"N/E",null,null,null,null,null,null,null,null,null,null,null,null,null,null,null,null,null,null,null,null,null,null,null,null,null,null,null,null,null,null,null,"N/E"]
[null,0,0,{"$f":"IF($B$1=3,TRUE,FALSE)","v":false},null,null,0,0,0,0,null,null,"CO8.ac3. Analyser/valider les choix structurels et de confort",4,null,null,null,null,null,null,null,null,null,null,null,null,null,null,null,null,null,null,null,null,null,null,null,null,null,null,null,null,null,null,null,null,null,null,null,null,"N/E",null,null,null,null,null,null,null,null,null,null,null,null,null,null,null,null,null,null,null,null,null,null,null,null,null,null,null,null,null,null,null,"N/E",null,null,null,null,null,null,null,null,null,null,null,null,null,null,null,null,null,null,null,null,null,null,null,null,null,null,null,null,null,null,null,"N/E",null,null,null,null,null,null,null,null,null,null,null,null,null,null,null,null,null,null,null,null,null,null,null,null,null,null,null,null,null,null,null,"N/E",null,null,null,null,null,null,null,null,null,null,null,null,null,null,null,null,null,null,null,null,null,null,null,null,null,null,null,null,null,null,null,"N/E"]
[null,3,3,{"$f":"IF($B$1=4,TRUE,FALSE)","v":true},null,null,3,3,0,0,null,null,"CO8.ee1. Renseigner un logiciel de simulation du comportement énergétique avec les caractéristiques du système et les paramètres externes pour un point de fonctionnement donné",3,null,null,null,null,null,null,null,null,null,null,null,null,null,null,null,null,null,null,null,null,null,null,null,null,null,null,null,null,null,null,null,null,null,null,null,null,"N/E",null,null,null,null,null,null,null,null,null,null,null,null,null,null,null,null,null,null,null,null,null,null,null,null,null,null,null,null,null,null,null,"N/E",null,"x",null,null,null,null,null,null,null,null,null,null,null,null,null,null,null,null,null,null,null,null,null,null,null,null,null,null,null,null,null,"OK",null,null,null,null,null,null,null,null,null,null,null,null,null,null,null,null,null,null,null,null,null,null,null,null,null,null,null,null,null,null,null,"OK",null,null,null,null,null,null,null,null,null,null,null,null,null,null,null,null,null,null,null,null,null,null,null,null,null,null,null,null,null,null,null,"OK"]
[null,4,0,{"$f":"IF($B$1=4,TRUE,FALSE)","v":true},null,null,4,0,0,0,null,null,"CO8.ee2. Interpréter les résultats d'une simulation afin de valider une solution ou l’optimiser",4,null,null,null,null,null,null,null,null,null,null,null,null,null,null,null,null,null,null,null,null,null,null,null,null,null,null,null,null,null,null,null,null,null,null,null,null,"N/E",null,null,null,null,null,null,null,null,null,null,null,null,null,null,null,null,null,null,null,null,null,null,null,null,null,null,null,null,null,null,null,"N/E",null,null,null,null,null,null,null,null,null,null,null,null,null,null,null,null,null,null,null,null,null,null,null,null,null,null,null,null,null,null,null,"N/E",null,null,null,null,null,null,null,null,null,null,null,null,null,null,null,null,null,null,null,null,null,null,null,null,null,null,null,null,null,null,null,"N/E",null,null,null,null,null,null,null,null,null,null,null,null,null,null,null,null,null,null,null,null,null,null,null,null,null,null,null,null,null,null,null,"N/E"]
[null,3,0,{"$f":"IF($B$1=4,TRUE,FALSE)","v":true},null,null,3,0,0,0,null,null,"CO8.ee3. Comparer et interpréter le résultat d'une simulation d'un comportement d’un système avec un comportement réel",3,null,null,null,null,null,null,null,null,null,null,null,null,null,null,null,null,null,null,null,null,null,null,null,null,null,null,null,null,null,null,null,null,null,null,null,null,"N/E",null,null,null,null,null,null,null,null,null,null,null,null,null,null,null,null,null,null,null,null,null,null,null,null,null,null,null,null,null,null,null,"N/E",null,null,null,null,null,null,null,null,null,null,null,null,null,null,null,null,null,null,null,null,null,null,null,null,null,null,null,null,null,null,null,"N/E",null,null,null,null,null,null,null,null,null,null,null,null,null,null,null,null,null,null,null,null,null,null,null,null,null,null,null,null,null,null,null,"N/E",null,null,null,null,null,null,null,null,null,null,null,null,null,null,null,null,null,null,null,null,null,null,null,null,null,null,null,null,null,null,null,"N/E"]
[null,5,0,{"$f":"IF($B$1=4,TRUE,FALSE)","v":true},null,null,5,5,0,0,null,null,"CO8.ee4. Mettre en oeuvre un protocole d’essais et de mesures sur le prototype d’une chaîne d’énergie, interpréter les résultats",5,null,null,null,null,null,null,null,null,null,null,null,null,null,null,null,null,null,null,null,null,null,null,null,null,null,null,null,null,null,null,null,null,null,null,null,null,"N/E",null,null,null,null,null,null,null,null,null,null,null,null,null,null,null,null,null,null,null,null,null,null,null,null,null,null,null,null,null,null,null,"N/E",null,null,null,null,null,null,null,null,null,null,null,null,null,null,null,null,null,null,null,null,null,null,null,null,null,null,null,null,null,null,null,"N/E",null,null,null,null,null,null,null,null,null,null,null,null,null,null,null,null,null,null,null,null,null,null,null,null,null,null,null,null,null,null,null,"N/E",null,"x",null,null,null,null,null,null,null,null,null,null,null,null,null,null,null,null,null,null,null,null,null,null,null,null,null,null,null,null,null,"OK"]
[null,0,0,{"$f":"IF($B$1=5,TRUE,FALSE)","v":false},null,null,0,0,0,0,null,null,"CO8.itec1. Paramétrer un logiciel de simulation mécanique pour obtenir les caractéristiques d'une loi d'entrée/sortie d'un mécanisme simple",3,null,null,null,null,null,null,null,null,null,null,null,null,null,null,null,null,null,null,null,null,null,null,null,null,null,null,null,null,null,null,null,null,null,null,null,null,"N/E",null,null,null,null,null,null,null,null,null,null,null,null,null,null,null,null,null,null,null,null,null,null,null,null,null,null,null,null,null,null,null,"N/E",null,null,null,null,null,null,null,null,null,null,null,null,null,null,null,null,null,null,null,null,null,null,null,null,null,null,null,null,null,null,null,"N/E",null,null,null,null,null,null,null,null,null,null,null,null,null,null,null,null,null,null,null,null,null,null,null,null,null,null,null,null,null,null,null,"N/E",null,null,null,null,null,null,null,null,null,null,null,null,null,null,null,null,null,null,null,null,null,null,null,null,null,null,null,null,null,null,null,"N/E"]
[null,0,0,{"$f":"IF($B$1=5,TRUE,FALSE)","v":false},null,null,0,0,0,0,null,null,"CO8.itec2. Interpréter les résultats d'une simulation mécanique pour valider une solution ou modifier une pièce ou un mécanisme",4,null,null,null,null,null,null,null,null,null,null,null,null,null,null,null,null,null,null,null,null,null,null,null,null,null,null,null,null,null,null,null,null,null,null,null,null,"N/E",null,null,null,null,null,null,null,null,null,null,null,null,null,null,null,null,null,null,null,null,null,null,null,null,null,null,null,null,null,null,null,"N/E",null,null,null,null,null,null,null,null,null,null,null,null,null,null,null,null,null,null,null,null,null,null,null,null,null,null,null,null,null,null,null,"N/E",null,null,null,null,null,null,null,null,null,null,null,null,null,null,null,null,null,null,null,null,null,null,null,null,null,null,null,null,null,null,null,"N/E",null,null,null,null,null,null,null,null,null,null,null,null,null,null,null,null,null,null,null,null,null,null,null,null,null,null,null,null,null,null,null,"N/E"]
[null,0,0,{"$f":"IF($B$1=5,TRUE,FALSE)","v":false},null,null,0,0,0,0,null,null,"CO8.itec3. Mettre en oeuvre un protocole d’essais et de mesures, interpréter les résultats",5,null,null,null,null,null,null,null,null,null,null,null,null,null,null,null,null,null,null,null,null,null,null,null,null,null,null,null,null,null,null,null,null,null,null,null,null,"N/E",null,null,null,null,null,null,null,null,null,null,null,null,null,null,null,null,null,null,null,null,null,null,null,null,null,null,null,null,null,null,null,"N/E",null,null,null,null,null,null,null,null,null,null,null,null,null,null,null,null,null,null,null,null,null,null,null,null,null,null,null,null,null,null,null,"N/E",null,null,null,null,null,null,null,null,null,null,null,null,null,null,null,null,null,null,null,null,null,null,null,null,null,null,null,null,null,null,null,"N/E",null,null,null,null,null,null,null,null,null,null,null,null,null,null,null,null,null,null,null,null,null,null,null,null,null,null,null,null,null,null,null,"N/E"]
[null,0,0,{"$f":"IF($B$1=5,TRUE,FALSE)","v":false},null,null,0,0,0,0,null,null,"CO8.itec4. Comparer et interpréter le résultat d'une simulation d'un comportement mécanique avec un comportement réel",3,null,null,null,null,null,null,null,null,null,null,null,null,null,null,null,null,null,null,null,null,null,null,null,null,null,null,null,null,null,null,null,null,null,null,null,null,"N/E",null,null,null,null,null,null,null,null,null,null,null,null,null,null,null,null,null,null,null,null,null,null,null,null,null,null,null,null,null,null,null,"N/E",null,null,null,null,null,null,null,null,null,null,null,null,null,null,null,null,null,null,null,null,null,null,null,null,null,null,null,null,null,null,null,"N/E",null,null,null,null,null,null,null,null,null,null,null,null,null,null,null,null,null,null,null,null,null,null,null,null,null,null,null,null,null,null,null,"N/E",null,null,null,null,null,null,null,null,null,null,null,null,null,null,null,null,null,null,null,null,null,null,null,null,null,null,null,null,null,null,null,"N/E"]
[null,0,0,{"$f":"IF($B$1=6,TRUE,FALSE)","v":false},null,null,0,0,0,0,null,null,"CO8.sin1. Rechercher et choisir une solution logicielle ou matérielle au regard de la définition d'un système",3,null,null,null,null,null,null,null,null,null,null,null,null,null,null,null,null,null,null,null,null,null,null,null,null,null,null,null,null,null,null,null,null,null,null,null,null,"N/E",null,null,null,null,null,null,null,null,null,null,null,null,null,null,null,null,null,null,null,null,null,null,null,null,null,null,null,null,null,null,null,"N/E",null,null,null,null,null,null,null,null,null,null,null,null,null,null,null,null,null,null,null,null,null,null,null,null,null,null,null,null,null,null,null,"N/E",null,null,null,null,null,null,null,null,null,null,null,null,null,null,null,null,null,null,null,null,null,null,null,null,null,null,null,null,null,null,null,"N/E",null,null,null,null,null,null,null,null,null,null,null,null,null,null,null,null,null,null,null,null,null,null,null,null,null,null,null,null,null,null,null,"N/E"]
[null,0,0,{"$f":"IF($B$1=6,TRUE,FALSE)","v":false},null,null,0,0,0,0,null,null,"CO8.sin2. Établir pour une fonction précédemment identifiée un modèle de comportement à partir de mesures faites sur le système",4,null,null,null,null,null,null,null,null,null,null,null,null,null,null,null,null,null,null,null,null,null,null,null,null,null,null,null,null,null,null,null,null,null,null,null,null,"N/E",null,null,null,null,null,null,null,null,null,null,null,null,null,null,null,null,null,null,null,null,null,null,null,null,null,null,null,null,null,null,null,"N/E",null,null,null,null,null,null,null,null,null,null,null,null,null,null,null,null,null,null,null,null,null,null,null,null,null,null,null,null,null,null,null,"N/E",null,null,null,null,null,null,null,null,null,null,null,null,null,null,null,null,null,null,null,null,null,null,null,null,null,null,null,null,null,null,null,"N/E",null,null,null,null,null,null,null,null,null,null,null,null,null,null,null,null,null,null,null,null,null,null,null,null,null,null,null,null,null,null,null,"N/E"]
[null,0,0,{"$f":"IF($B$1=6,TRUE,FALSE)","v":false},null,null,0,0,0,0,null,null,"CO8.sin3. Traduire sous forme graphique l’architecture de la chaîne d’information identifiée pour un système et définir les paramètres d’utilisation du simulateur",3,null,null,null,null,null,null,null,null,null,null,null,null,null,null,null,null,null,null,null,null,null,null,null,null,null,null,null,null,null,null,null,null,null,null,null,null,"N/E",null,null,null,null,null,null,null,null,null,null,null,null,null,null,null,null,null,null,null,null,null,null,null,null,null,null,null,null,null,null,null,"N/E",null,null,null,null,null,null,null,null,null,null,null,null,null,null,null,null,null,null,null,null,null,null,null,null,null,null,null,null,null,null,null,"N/E",null,null,null,null,null,null,null,null,null,null,null,null,null,null,null,null,null,null,null,null,null,null,null,null,null,null,null,null,null,null,null,"N/E",null,null,null,null,null,null,null,null,null,null,null,null,null,null,null,null,null,null,null,null,null,null,null,null,null,null,null,null,null,null,null,"N/E"]
[null,0,0,{"$f":"IF($B$1=6,TRUE,FALSE)","v":false},null,null,0,0,0,0,null,null,"CO8.sin4. Identifier les variables simulées et mesurées sur un système pour valider le choix d’une solution",4,null,null,null,null,null,null,null,null,null,null,null,null,null,null,null,null,null,null,null,null,null,null,null,null,null,null,null,null,null,null,null,null,null,null,null,null,"N/E",null,null,null,null,null,null,null,null,null,null,null,null,null,null,null,null,null,null,null,null,null,null,null,null,null,null,null,null,null,null,null,"N/E",null,null,null,null,null,null,null,null,null,null,null,null,null,null,null,null,null,null,null,null,null,null,null,null,null,null,null,null,null,null,null,"N/E",null,null,null,null,null,null,null,null,null,null,null,null,null,null,null,null,null,null,null,null,null,null,null,null,null,null,null,null,null,null,null,"N/E",null,null,null,null,null,null,null,null,null,null,null,null,null,null,null,null,null,null,null,null,null,null,null,null,null,null,null,null,null,null,null,"N/E"]
[null,5,{"$f":"IF(FX45=\"OK\",N45,0)","v":0},{"$f":"IF($B$1>2,TRUE,FALSE)","v":true},null,null,0,0,5,0,null,null,"CO8.es Justifier des éléments d'une simulation relative au comportement de tout ou partie d'un système et les écarts par rapport au réel",5,null,null,null,null,null,null,null,null,null,null,null,null,null,null,null,null,null,null,null,null,null,null,null,null,null,null,null,null,null,null,null,null,null,null,null,null,">",null,null,null,null,null,null,null,null,null,null,null,null,null,null,null,null,null,null,null,null,null,null,null,null,null,null,null,null,null,null,null,">",null,null,null,null,null,null,null,null,null,null,null,null,null,null,null,null,null,null,null,null,null,null,null,null,null,null,null,null,null,null,null,">",null,null,null,null,null,null,null,null,null,null,null,null,null,null,null,null,null,null,null,null,null,null,null,null,null,null,null,null,null,null,null,">",null,null,null,null,null,null,null,null,null,null,null,null,null,null,null,null,null,null,null,null,null,null,null,null,null,null,null,null,null,null,null,">",{"$f":"IF(COUNTA(U45:FW45)>5,\"OK\",\"N/E\")","v":"N/E"}]
[null,null,null,{"$f":"IF($B$1>2,TRUE,FALSE)","v":true},null,null,null,null,null,null,null,null,"O9 – Gérer la vie du produit"]
[null,0,{"$f":"IF(OR(CE47=\"OK\",EQ47=\"OK\"),N47,0)","v":0},{"$f":"IF($B$1=3,TRUE,FALSE)","v":false},null,null,0,0,0,0,null,null,"CO9.ac1. Améliorer les performances d’une construction du point de vue énergétique, domotique et informationnel",5,null,null,null,null,null,null,null,null,null,null,null,null,null,null,null,null,null,null,null,null,null,null,null,null,null,null,null,null,null,null,null,null,null,null,null,null,{"$f":"IF(AND(AY$1<>\"\",COUNTA(U47:AX47)>0),\"OK\",\"N/E\")","v":"N/E"},null,null,null,null,null,null,null,null,null,null,null,null,null,null,null,null,null,null,null,null,null,null,null,null,null,null,null,null,null,null,null,{"$f":"IF(AND(CE$1<>\"\",COUNTA(U47:CD47)>1),\"OK\",\"N/E\")","v":"N/E"},null,null,null,null,null,null,null,null,null,null,null,null,null,null,null,null,null,null,null,null,null,null,null,null,null,null,null,null,null,null,null,{"$f":"IF(AND(DK$1<>\"\",COUNTA(U47:DJ47)>2),\"OK\",\"N/E\")","v":"N/E"},null,null,null,null,null,null,null,null,null,null,null,null,null,null,null,null,null,null,null,null,null,null,null,null,null,null,null,null,null,null,null,{"$f":"IF(AND(EQ$1<>\"\",COUNTA(U47:EP47)>3),\"OK\",\"N/E\")","v":"N/E"},null,null,null,null,null,null,null,null,null,null,null,null,null,null,null,null,null,null,null,null,null,null,null,null,null,null,null,null,null,null,null,{"$f":"IF(AND(FW$1<>\"\",COUNTA(U47:FV47)>4),\"OK\",\"N/E\")","v":"N/E"}]
[null,0,0,{"$f":"IF($B$1=3,TRUE,FALSE)","v":false},null,null,0,0,0,0,null,null,"CO9.ac2. Identifier et décrire les causes de désordre dans une construction",3,null,null,null,null,null,null,null,null,null,null,null,null,null,null,null,null,null,null,null,null,null,null,null,null,null,null,null,null,null,null,null,null,null,null,null,null,"N/E",null,null,null,null,null,null,null,null,null,null,null,null,null,null,null,null,null,null,null,null,null,null,null,null,null,null,null,null,null,null,null,"N/E",null,null,null,null,null,null,null,null,null,null,null,null,null,null,null,null,null,null,null,null,null,null,null,null,null,null,null,null,null,null,null,"N/E",null,null,null,null,null,null,null,null,null,null,null,null,null,null,null,null,null,null,null,null,null,null,null,null,null,null,null,null,null,null,null,"N/E",null,null,null,null,null,null,null,null,null,null,null,null,null,null,null,null,null,null,null,null,null,null,null,null,null,null,null,null,null,null,null,"N/E"]
[null,0,0,{"$f":"IF($B$1=3,TRUE,FALSE)","v":false},null,null,0,0,0,0,null,null,"CO9.ac3. Valoriser la fin de vie du produit : déconstruction, gestion des déchets, valorisation des produits",3,null,null,null,null,null,null,null,null,null,null,null,null,null,null,null,null,null,null,null,null,null,null,null,null,null,null,null,null,null,null,null,null,null,null,null,null,"N/E",null,null,null,null,null,null,null,null,null,null,null,null,null,null,null,null,null,null,null,null,null,null,null,null,null,null,null,null,null,null,null,"N/E",null,null,null,null,null,null,null,null,null,null,null,null,null,null,null,null,null,null,null,null,null,null,null,null,null,null,null,null,null,null,null,"N/E",null,null,null,null,null,null,null,null,null,null,null,null,null,null,null,null,null,null,null,null,null,null,null,null,null,null,null,null,null,null,null,"N/E",null,null,null,null,null,null,null,null,null,null,null,null,null,null,null,null,null,null,null,null,null,null,null,null,null,null,null,null,null,null,null,"N/E"]
[null,3,0,{"$f":"IF($B$1=4,TRUE,FALSE)","v":true},null,null,3,3,0,0,null,null,"CO9.ee1. Expérimenter des procédés de stockage, de production, de transport, de transformation, d’énergie pour aider à la conception d’une chaîne d’énergie",3,null,null,null,null,null,null,null,null,null,null,null,null,null,null,null,null,null,null,null,null,null,null,null,null,null,null,null,null,null,null,null,null,null,null,null,null,"N/E",null,null,null,null,null,null,null,null,null,null,null,null,null,null,null,null,null,null,null,null,null,null,null,null,null,null,null,null,null,null,null,"N/E",null,null,null,null,null,null,null,null,null,null,null,null,null,null,null,null,null,null,null,null,null,null,null,null,null,null,null,null,null,null,null,"N/E",null,null,null,null,null,null,null,null,null,null,null,null,null,null,null,null,null,null,null,null,null,null,null,null,null,null,null,null,null,null,null,"N/E",null,"x",null,null,null,null,null,null,null,null,null,null,null,null,null,null,null,null,null,null,null,null,null,null,null,null,null,null,null,null,null,"OK"]
[null,4,4,{"$f":"IF($B$1=4,TRUE,FALSE)","v":true},null,null,4,4,0,0,null,null,"CO9.ee2. Réaliser et valider un prototype obtenu en réponse à tout ou partie du cahier des charges initial",4,null,null,null,null,null,null,null,null,null,null,null,null,null,null,null,null,null,null,null,null,null,null,null,null,null,null,null,null,null,null,null,null,null,null,null,null,"N/E",null,null,null,null,null,null,null,null,null,null,null,null,null,null,null,null,null,null,null,null,null,null,null,null,null,null,null,null,null,null,null,"N/E",null,null,null,null,null,null,null,null,null,null,null,null,null,null,null,null,null,null,null,null,null,null,null,null,null,null,null,null,null,null,null,"N/E",null,"x",null,null,null,null,null,null,null,null,null,null,null,null,null,null,null,null,null,null,null,null,null,null,null,null,null,null,null,null,null,"OK",null,null,null,null,null,null,null,null,null,null,null,null,null,null,null,null,null,null,null,null,null,null,null,null,null,null,null,null,null,null,null,"OK"]
[null,4,0,{"$f":"IF($B$1=4,TRUE,FALSE)","v":true},null,null,4,4,0,0,null,null,"CO9.ee3. Intégrer un prototype dans un système à modifier pour valider son comportement et ses performances",4,null,null,null,null,null,null,null,null,null,null,null,null,null,null,null,null,null,null,null,null,null,null,null,null,null,null,null,null,null,null,null,null,null,null,null,null,"N/E",null,null,null,null,null,null,null,null,null,null,null,null,null,null,null,null,null,null,null,null,null,null,null,null,null,null,null,null,null,null,null,"N/E",null,null,null,null,null,null,null,null,null,null,null,null,null,null,null,null,null,null,null,null,null,null,null,null,null,null,null,null,null,null,null,"N/E",null,null,null,null,null,null,null,null,null,null,null,null,null,null,null,null,null,null,null,null,null,null,null,null,null,null,null,null,null,null,null,"N/E",null,"x",null,null,null,null,null,null,null,null,null,null,null,null,null,null,null,null,null,null,null,null,null,null,null,null,null,null,null,null,null,"OK"]
[null,0,0,{"$f":"IF($B$1=5,TRUE,FALSE)","v":false},null,null,0,0,0,0,null,null,"CO9.itec1. Expérimenter des procédés pour caractériser les paramètres de transformation de la matière et leurs conséquences sur la définition et l’obtention de pièces",3,null,null,null,null,null,null,null,null,null,null,null,null,null,null,null,null,null,null,null,null,null,null,null,null,null,null,null,null,null,null,null,null,null,null,null,null,"N/E",null,null,null,null,null,null,null,null,null,null,null,null,null,null,null,null,null,null,null,null,null,null,null,null,null,null,null,null,null,null,null,"N/E",null,null,null,null,null,null,null,null,null,null,null,null,null,null,null,null,null,null,null,null,null,null,null,null,null,null,null,null,null,null,null,"N/E",null,null,null,null,null,null,null,null,null,null,null,null,null,null,null,null,null,null,null,null,null,null,null,null,null,null,null,null,null,null,null,"N/E",null,null,null,null,null,null,null,null,null,null,null,null,null,null,null,null,null,null,null,null,null,null,null,null,null,null,null,null,null,null,null,"N/E"]
[null,0,0,{"$f":"IF($B$1=5,TRUE,FALSE)","v":false},null,null,0,0,0,0,null,null,"CO9.itec2. Réaliser et valider un prototype obtenu par rapport à tout ou partie du cahier des charges initial",4,null,null,null,null,null,null,null,null,null,null,null,null,null,null,null,null,null,null,null,null,null,null,null,null,null,null,null,null,null,null,null,null,null,null,null,null,"N/E",null,null,null,null,null,null,null,null,null,null,null,null,null,null,null,null,null,null,null,null,null,null,null,null,null,null,null,null,null,null,null,"N/E",null,null,null,null,null,null,null,null,null,null,null,null,null,null,null,null,null,null,null,null,null,null,null,null,null,null,null,null,null,null,null,"N/E",null,null,null,null,null,null,null,null,null,null,null,null,null,null,null,null,null,null,null,null,null,null,null,null,null,null,null,null,null,null,null,"N/E",null,null,null,null,null,null,null,null,null,null,null,null,null,null,null,null,null,null,null,null,null,null,null,null,null,null,null,null,null,null,null,"N/E"]
[null,0,0,{"$f":"IF($B$1=5,TRUE,FALSE)","v":false},null,null,0,0,0,0,null,null,"CO9.itec3. Intégrer les pièces prototypes dans le système à modifier pour valider son comportement et ses performances",4,null,null,null,null,null,null,null,null,null,null,null,null,null,null,null,null,null,null,null,null,null,null,null,null,null,null,null,null,null,null,null,null,null,null,null,null,"N/E",null,null,null,null,null,null,null,null,null,null,null,null,null,null,null,null,null,null,null,null,null,null,null,null,null,null,null,null,null,null,null,"N/E",null,null,null,null,null,null,null,null,null,null,null,null,null,null,null,null,null,null,null,null,null,null,null,null,null,null,null,null,null,null,null,"N/E",null,null,null,null,null,null,null,null,null,null,null,null,null,null,null,null,null,null,null,null,null,null,null,null,null,null,null,null,null,null,null,"N/E",null,null,null,null,null,null,null,null,null,null,null,null,null,null,null,null,null,null,null,null,null,null,null,null,null,null,null,null,null,null,null,"N/E"]
[null,0,0,{"$f":"IF($B$1=6,TRUE,FALSE)","v":false},null,null,0,0,0,0,null,null,"CO9.sin1. Utiliser les outils adaptés pour planifier un projet (diagramme de Gantt, chemin critique, données économiques, réunions de projet)",3,null,null,null,null,null,null,null,null,null,null,null,null,null,null,null,null,null,null,null,null,null,null,null,null,null,null,null,null,null,null,null,null,null,null,null,null,"N/E",null,null,null,null,null,null,null,null,null,null,null,null,null,null,null,null,null,null,null,null,null,null,null,null,null,null,null,null,null,null,null,"N/E",null,null,null,null,null,null,null,null,null,null,null,null,null,null,null,null,null,null,null,null,null,null,null,null,null,null,null,null,null,null,null,"N/E",null,null,null,null,null,null,null,null,null,null,null,null,null,null,null,null,null,null,null,null,null,null,null,null,null,null,null,null,null,null,null,"N/E",null,null,null,null,null,null,null,null,null,null,null,null,null,null,null,null,null,null,null,null,null,null,null,null,null,null,null,null,null,null,null,"N/E"]
[null,0,0,{"$f":"IF($B$1=6,TRUE,FALSE)","v":false},null,null,0,0,0,0,null,null,"CO9.sin2. Installer, configurer et instrumenter un système réel Mettre en oeuvre la chaîne d’acquisition puis acquérir, traiter, transmettre et restituer l’information",5,null,null,null,null,null,null,null,null,null,null,null,null,null,null,null,null,null,null,null,null,null,null,null,null,null,null,null,null,null,null,null,null,null,null,null,null,"N/E",null,null,null,null,null,null,null,null,null,null,null,null,null,null,null,null,null,null,null,null,null,null,null,null,null,null,null,null,null,null,null,"N/E",null,null,null,null,null,null,null,null,null,null,null,null,null,null,null,null,null,null,null,null,null,null,null,null,null,null,null,null,null,null,null,"N/E",null,null,null,null,null,null,null,null,null,null,null,null,null,null,null,null,null,null,null,null,null,null,null,null,null,null,null,null,null,null,null,"N/E",null,null,null,null,null,null,null,null,null,null,null,null,null,null,null,null,null,null,null,null,null,null,null,null,null,null,null,null,null,null,null,"N/E"]
[null,0,0,{"$f":"IF($B$1=6,TRUE,FALSE)","v":false},null,null,0,0,0,0,null,null,"CO9.sin3. Rechercher des évolutions de constituants dans le cadre d’une démarche de veille technologique, analyser la structure d'un système pour intervenir sur les constituants dans le cadre d'une opération de maintenance",4,null,null,null,null,null,null,null,null,null,null,null,null,null,null,null,null,null,null,null,null,null,null,null,null,null,null,null,null,null,null,null,null,null,null,null,null,"N/E",null,null,null,null,null,null,null,null,null,null,null,null,null,null,null,null,null,null,null,null,null,null,null,null,null,null,null,null,null,null,null,"N/E",null,null,null,null,null,null,null,null,null,null,null,null,null,null,null,null,null,null,null,null,null,null,null,null,null,null,null,null,null,null,null,"N/E",null,null,null,null,null,null,null,null,null,null,null,null,null,null,null,null,null,null,null,null,null,null,null,null,null,null,null,null,null,null,null,"N/E",null,null,null,null,null,null,null,null,null,null,null,null,null,null,null,null,null,null,null,null,null,null,null,null,null,null,null,null,null,null,null,"N/E"]
[null,0,0,{"$f":"IF($B$1=6,TRUE,FALSE)","v":false},null,null,0,0,0,0,null,null,"CO9.sin4. Rechercher et choisir de nouveaux constituants d’un système (ou d’un projet finalisé) au regard d’évolutions technologiques, socio-économiques spécifiées dans un cahier des charges. Organiser le projet permettant de « maquettiser » la solution choisie",5,null,null,null,null,null,null,null,null,null,null,null,null,null,null,null,null,null,null,null,null,null,null,null,null,null,null,null,null,null,null,null,null,null,null,null,null,"N/E",null,null,null,null,null,null,null,null,null,null,null,null,null,null,null,null,null,null,null,null,null,null,null,null,null,null,null,null,null,null,null,"N/E",null,null,null,null,null,null,null,null,null,null,null,null,null,null,null,null,null,null,null,null,null,null,null,null,null,null,null,null,null,null,null,"N/E",null,null,null,null,null,null,null,null,null,null,null,null,null,null,null,null,null,null,null,null,null,null,null,null,null,null,null,null,null,null,null,"N/E",null,null,null,null,null,null,null,null,null,null,null,null,null,null,null,null,null,null,null,null,null,null,null,null,null,null,null,null,null,null,null,"N/E"]
[null,null,null,{"$f":"IF($B$1=2,TRUE,FALSE)","v":false},null,null,null,null,null,null,null,"B","-  Modéliser",0.4]
[null,null,null,false,null,null,null,null,null,null,null,null,"B3 - Résoudre et simuler : Simuler le fonctionnement de tout ou partie d’un système à l’aide d’un modèle fourni"]
[null,{"$f":"N62*D62*$N$60","v":0},{"$f":"IF(COUNTA(T62:CD62)<>0,N62,0)","v":0.2},false,null,null,0,0,0,0,null,null,"Les paramètres influents sont identifiés",0.2,null,null,null,null,null,null,null,null,null,null,null,null,null,null,null,null,null,null,null,null,null,null,null,null,null,null,null,null,null,null,null,null,null,null,null,null,{"$f":"IF(AND(AY$1<>\"\",COUNTA(U62:AX62)>0),\"OK\",\"N/E\")","v":"N/E"},null,null,null,null,null,null,null,null,null,null,null,null,null,null,null,null,null,null,null,null,null,null,null,null,null,null,null,null,null,null,null,{"$f":"IF(AND(CE$1<>\"\",COUNTA(U62:CD62)>1),\"OK\",\"N/E\")","v":"N/E"},null,null,null,null,null,null,null,null,null,null,null,null,null,null,null,null,null,null,null,null,null,null,null,null,null,null,null,null,null,null,null,{"$f":"IF(AND(DK$1<>\"\",COUNTA(U62:DJ62)>2),\"OK\",\"N/E\")","v":"N/E"},null,null,null,null,null,null,null,null,null,null,null,null,null,null,null,null,null,null,null,null,null,null,null,null,null,null,null,null,null,null,null,{"$f":"IF(AND(EQ$1<>\"\",COUNTA(U62:EP62)>3),\"OK\",\"N/E\")","v":"N/E"},null,null,null,null,null,null,null,null,null,null,null,null,null,null,null,null,null,null,null,null,null,null,null,null,null,null,null,null,null,null,null,{"$f":"IF(AND(FW$1<>\"\",COUNTA(U62:FV62)>4),\"OK\",\"N/E\")","v":"N/E"}]
[null,{"$f":"N63*D63*$N$60","v":0},0.2,false,null,null,0,0,0,0,null,null,"Les limites de simulation sont correctement définies",0.2,null,null,null,null,null,null,null,null,null,null,null,null,null,null,null,null,null,null,null,null,null,null,null,null,null,null,null,null,null,null,null,null,null,null,null,null,{"$f":"IF(AND(AY$1<>\"\",COUNTA(U63:AX63)>0),\"OK\",\"N/E\")","v":"N/E"},null,null,null,null,null,null,null,null,null,null,null,null,null,null,null,null,null,null,null,null,null,null,null,null,null,null,null,null,null,null,null,{"$f":"IF(AND(CE$1<>\"\",COUNTA(U63:CD63)>1),\"OK\",\"N/E\")","v":"N/E"},null,null,null,null,null,null,null,null,null,null,null,null,null,null,null,null,null,null,null,null,null,null,null,null,null,null,null,null,null,null,null,{"$f":"IF(AND(DK$1<>\"\",COUNTA(U63:DJ63)>2),\"OK\",\"N/E\")","v":"N/E"},null,null,null,null,null,null,null,null,null,null,null,null,null,null,null,null,null,null,null,null,null,null,null,null,null,null,null,null,null,null,null,{"$f":"IF(AND(EQ$1<>\"\",COUNTA(U63:EP63)>3),\"OK\",\"N/E\")","v":"N/E"},null,null,null,null,null,null,null,null,null,null,null,null,null,null,null,null,null,null,null,null,null,null,null,null,null,null,null,null,null,null,null,{"$f":"IF(AND(FW$1<>\"\",COUNTA(U63:FV63)>4),\"OK\",\"N/E\")","v":"N/E"}]
[null,null,null,false,null,null,null,null,null,null,null,null,"B4 - Valider un modèle : Valider un modèle fourni, interpréter les résultats obtenus, préciser les limites de validité du modèle utilisé et modifier les paramètres du modèle pour répondre au cahier des charges ou aux résultats expérimentaux"]
[null,{"$f":"N65*D65*$N$60","v":0},0.15,false,null,null,0,0,0,0,null,null,"Les résultats sont correctement interprétés",0.15,null,null,null,null,null,null,null,null,null,null,null,null,null,null,null,null,null,null,null,null,null,null,null,null,null,null,null,null,null,null,null,null,null,null,null,null,">",null,null,null,null,null,null,null,null,null,null,null,null,null,null,null,null,null,null,null,null,null,null,null,null,null,null,null,null,null,null,null,">",null,null,null,null,null,null,null,null,null,null,null,null,null,null,null,null,null,null,null,null,null,null,null,null,null,null,null,null,null,null,null,">",null,null,null,null,null,null,null,null,null,null,null,null,null,null,null,null,null,null,null,null,null,null,null,null,null,null,null,null,null,null,null,">",null,null,null,null,null,null,null,null,null,null,null,null,null,null,null,null,null,null,null,null,null,null,null,null,null,null,null,null,null,null,null,">",{"$f":"IF(COUNTA(U65:FW65)>5,\"OK\",\"N/E\")","v":"N/E"}]
[null,{"$f":"N66*D66*$N$60","v":0},0.15,false,null,null,0,0,0,0,null,null,"Ces limites sont explicitées",0.15,null,null,null,null,null,null,null,null,null,null,null,null,null,null,null,null,null,null,null,null,null,null,null,null,null,null,null,null,null,null,null,null,null,null,null,null,">",null,null,null,null,null,null,null,null,null,null,null,null,null,null,null,null,null,null,null,null,null,null,null,null,null,null,null,null,null,null,null,">",null,null,null,null,null,null,null,null,null,null,null,null,null,null,null,null,null,null,null,null,null,null,null,null,null,null,null,null,null,null,null,">",null,null,null,null,null,null,null,null,null,null,null,null,null,null,null,null,null,null,null,null,null,null,null,null,null,null,null,null,null,null,null,">",null,null,null,null,null,null,null,null,null,null,null,null,null,null,null,null,null,null,null,null,null,null,null,null,null,null,null,null,null,null,null,">",{"$f":"IF(COUNTA(U66:FW66)>5,\"OK\",\"N/E\")","v":"N/E"}]
[null,{"$f":"N67*D67*$N$60","v":0},0.15,false,null,null,0,0,0,0,null,null,"Les paramètres modifiés sont pertinents",0.15,null,null,null,null,null,null,null,null,null,null,null,null,null,null,null,null,null,null,null,null,null,null,null,null,null,null,null,null,null,null,null,null,null,null,null,null,">",null,null,null,null,null,null,null,null,null,null,null,null,null,null,null,null,null,null,null,null,null,null,null,null,null,null,null,null,null,null,null,">",null,null,null,null,null,null,null,null,null,null,null,null,null,null,null,null,null,null,null,null,null,null,null,null,null,null,null,null,null,null,null,">",null,null,null,null,null,null,null,null,null,null,null,null,null,null,null,null,null,null,null,null,null,null,null,null,null,null,null,null,null,null,null,">",null,null,null,null,null,null,null,null,null,null,null,null,null,null,null,null,null,null,null,null,null,null,null,null,null,null,null,null,null,null,null,">",{"$f":"IF(COUNTA(U67:FW67)>5,\"OK\",\"N/E\")","v":"N/E"}]
[null,{"$f":"N68*D68*$N$60","v":0},0.15,false,null,null,0,0,0,0,null,null,"Le modèle modifié répond aux attentes ",0.15,null,null,null,null,null,null,null,null,null,null,null,null,null,null,null,null,null,null,null,null,null,null,null,null,null,null,null,null,null,null,null,null,null,null,null,null,">",null,null,null,null,null,null,null,null,null,null,null,null,null,null,null,null,null,null,null,null,null,null,null,null,null,null,null,null,null,null,null,">",null,null,null,null,null,null,null,null,null,null,null,null,null,null,null,null,null,null,null,null,null,null,null,null,null,null,null,null,null,null,null,">",null,null,null,null,null,null,null,null,null,null,null,null,null,null,null,null,null,null,null,null,null,null,null,null,null,null,null,null,null,null,null,">",null,null,null,null,null,null,null,null,null,null,null,null,null,null,null,null,null,null,null,null,null,null,null,null,null,null,null,null,null,null,null,">",{"$f":"IF(COUNTA(U68:FW68)>5,\"OK\",\"N/E\")","v":"N/E"}]
[null,null,null,false,null,null,null,null,null,null,null,"C","-  Expérimenter",0.4]
[null,null,null,false,null,null,null,null,null,null,null,null," C1 - Justifier le choix d’un protocole expérimental : Identifier les grandeurs physiques à mesurer, décrire une chaîne d'acquisition, identifier le comportement des composants et justifier le choix des essais réalisés"]
[null,{"$f":"N71*D71*$N$69","v":0},{"$f":"IF(COUNTA(T71:CD71)<>0,N71,0)","v":0.08},false,null,null,{"$f":"IF($FX71=\"\",$B71,0)","v":0},{"$f":"IF(OR($AY71=\"OK\",$CE71=\"OK\",$DK71=\"OK\",$EQ71=\"OK\",$FW71=\"OK\"),$B71,0)","v":0},{"$f":"IF($FX71=\"\",0,$B71)","v":0},{"$f":"IF($FX71=\"OK\",$B71,0)","v":0},null,null,"Les grandeurs spécifiques (d'entrée, sortie, matière d'œuvre…) sont correctement identifiées",0.08,null,null,null,null,null,null,null,null,null,null,null,null,null,null,null,null,null,null,null,null,null,null,null,null,null,null,null,null,null,null,null,null,null,null,null,null,{"$f":"IF(AND(AY$1<>\"\",COUNTA(U71:AX71)>0),\"OK\",\"N/E\")","v":"N/E"},null,null,null,null,null,null,null,null,null,null,null,null,null,null,null,null,null,null,null,null,null,null,null,null,null,null,null,null,null,null,null,{"$f":"IF(AND(CE$1<>\"\",COUNTA(U71:CD71)>1),\"OK\",\"N/E\")","v":"N/E"},null,null,null,null,null,null,null,null,null,null,null,null,null,null,null,null,null,null,null,null,null,null,null,null,null,null,null,null,null,null,null,{"$f":"IF(AND(DK$1<>\"\",COUNTA(U71:DJ71)>2),\"OK\",\"N/E\")","v":"N/E"},null,null,null,null,null,null,null,null,null,null,null,null,null,null,null,null,null,null,null,null,null,null,null,null,null,null,null,null,null,null,null,{"$f":"IF(AND(EQ$1<>\"\",COUNTA(U71:EP71)>3),\"OK\",\"N/E\")","v":"N/E"},null,null,null,null,null,null,null,null,null,null,null,null,null,null,null,null,null,null,null,null,null,null,null,null,null,null,null,null,null,null,null,{"$f":"IF(AND(FW$1<>\"\",COUNTA(U71:FV71)>4),\"OK\",\"N/E\")","v":"N/E"}]
[null,{"$f":"N72*D72*$N$69","v":0},0.08,false,null,null,0,0,0,0,null,null,"Les éléments de la chaîne sont correctement identifiés ",0.08,null,null,null,null,null,null,null,null,null,null,null,null,null,null,null,null,null,null,null,null,null,null,null,null,null,null,null,null,null,null,null,null,null,null,null,null,{"$f":"IF(AND(AY$1<>\"\",COUNTA(U72:AX72)>0),\"OK\",\"N/E\")","v":"N/E"},null,null,null,null,null,null,null,null,null,null,null,null,null,null,null,null,null,null,null,null,null,null,null,null,null,null,null,null,null,null,null,{"$f":"IF(AND(CE$1<>\"\",COUNTA(U72:CD72)>1),\"OK\",\"N/E\")","v":"N/E"},null,null,null,null,null,null,null,null,null,null,null,null,null,null,null,null,null,null,null,null,null,null,null,null,null,null,null,null,null,null,null,{"$f":"IF(AND(DK$1<>\"\",COUNTA(U72:DJ72)>2),\"OK\",\"N/E\")","v":"N/E"},null,null,null,null,null,null,null,null,null,null,null,null,null,null,null,null,null,null,null,null,null,null,null,null,null,null,null,null,null,null,null,{"$f":"IF(AND(EQ$1<>\"\",COUNTA(U72:EP72)>3),\"OK\",\"N/E\")","v":"N/E"},null,null,null,null,null,null,null,null,null,null,null,null,null,null,null,null,null,null,null,null,null,null,null,null,null,null,null,null,null,null,null,{"$f":"IF(AND(FW$1<>\"\",COUNTA(U72:FV72)>4),\"OK\",\"N/E\")","v":"N/E"}]
[null,{"$f":"N73*D73*$N$69","v":0},7.0000000000000007E-2,false,null,null,0,0,0,0,null,null,"Les choix et réglages des capteurs et appareils de mesure sont correctement explicités",7.0000000000000007E-2,null,null,null,null,null,null,null,null,null,null,null,null,null,null,null,null,null,null,null,null,null,null,null,null,null,null,null,null,null,null,null,null,null,null,null,null,{"$f":"IF(AND(AY$1<>\"\",COUNTA(U73:AX73)>0),\"OK\",\"N/E\")","v":"N/E"},null,null,null,null,null,null,null,null,null,null,null,null,null,null,null,null,null,null,null,null,null,null,null,null,null,null,null,null,null,null,null,{"$f":"IF(AND(CE$1<>\"\",COUNTA(U73:CD73)>1),\"OK\",\"N/E\")","v":"N/E"},null,null,null,null,null,null,null,null,null,null,null,null,null,null,null,null,null,null,null,null,null,null,null,null,null,null,null,null,null,null,null,{"$f":"IF(AND(DK$1<>\"\",COUNTA(U73:DJ73)>2),\"OK\",\"N/E\")","v":"N/E"},null,null,null,null,null,null,null,null,null,null,null,null,null,null,null,null,null,null,null,null,null,null,null,null,null,null,null,null,null,null,null,{"$f":"IF(AND(EQ$1<>\"\",COUNTA(U73:EP73)>3),\"OK\",\"N/E\")","v":"N/E"},null,null,null,null,null,null,null,null,null,null,null,null,null,null,null,null,null,null,null,null,null,null,null,null,null,null,null,null,null,null,null,{"$f":"IF(AND(FW$1<>\"\",COUNTA(U73:FV73)>4),\"OK\",\"N/E\")","v":"N/E"}]
[null,{"$f":"N74*D74*$N$69","v":0},0.1,false,null,null,0,0,0,0,null,null,"Un protocole expérimental adapté de recueil de résultats est conçu ou complété, validé et mis en œuvre",0.1,null,null,null,null,null,null,null,null,null,null,null,null,null,null,null,null,null,null,null,null,null,null,null,null,null,null,null,null,null,null,null,null,null,null,null,null,{"$f":"IF(AND(AY$1<>\"\",COUNTA(U74:AX74)>0),\"OK\",\"N/E\")","v":"N/E"},null,null,null,null,null,null,null,null,null,null,null,null,null,null,null,null,null,null,null,null,null,null,null,null,null,null,null,null,null,null,null,{"$f":"IF(AND(CE$1<>\"\",COUNTA(U74:CD74)>1),\"OK\",\"N/E\")","v":"N/E"},null,null,null,null,null,null,null,null,null,null,null,null,null,null,null,null,null,null,null,null,null,null,null,null,null,null,null,null,null,null,null,{"$f":"IF(AND(DK$1<>\"\",COUNTA(U74:DJ74)>2),\"OK\",\"N/E\")","v":"N/E"},null,null,null,null,null,null,null,null,null,null,null,null,null,null,null,null,null,null,null,null,null,null,null,null,null,null,null,null,null,null,null,{"$f":"IF(AND(EQ$1<>\"\",COUNTA(U74:EP74)>3),\"OK\",\"N/E\")","v":"N/E"},null,null,null,null,null,null,null,null,null,null,null,null,null,null,null,null,null,null,null,null,null,null,null,null,null,null,null,null,null,null,null,{"$f":"IF(AND(FW$1<>\"\",COUNTA(U74:FV74)>4),\"OK\",\"N/E\")","v":"N/E"}]
[null,{"$f":"N75*D75*$N$69","v":0},0.05,false,null,null,0,0,0,0,null,null,"Le comportement est précisément décrit",0.05,null,null,null,null,null,null,null,null,null,null,null,null,null,null,null,null,null,null,null,null,null,null,null,null,null,null,null,null,null,null,null,null,null,null,null,null,">",null,null,null,null,null,null,null,null,null,null,null,null,null,null,null,null,null,null,null,null,null,null,null,null,null,null,null,null,null,null,null,">",null,null,null,null,null,null,null,null,null,null,null,null,null,null,null,null,null,null,null,null,null,null,null,null,null,null,null,null,null,null,null,">",null,null,null,null,null,null,null,null,null,null,null,null,null,null,null,null,null,null,null,null,null,null,null,null,null,null,null,null,null,null,null,">",null,null,null,null,null,null,null,null,null,null,null,null,null,null,null,null,null,null,null,null,null,null,null,null,null,null,null,null,null,null,null,">",{"$f":"IF(COUNTA(U75:FW75)>5,\"OK\",\"N/E\")","v":"N/E"}]
[null,null,null,false,null,null,null,null,null,null,null,null,"C2 - Mettre en œuvre un protocole expérimental : Conduire les essais en respectant les consignes de sécurité à partir d’un protocole fourni et traiter les données mesurées en vue d’analyser les écarts"]
[null,{"$f":"N77*D77*$N$69","v":0},0.08,false,null,null,0,0,0,0,null,null,"Les capteurs et appareils de mesure sont correctement mis en œuvre",0.08,null,null,null,null,null,null,null,null,null,null,null,null,null,null,null,null,null,null,null,null,null,null,null,null,null,null,null,null,null,null,null,null,null,null,null,null,{"$f":"IF(AND(AY$1<>\"\",COUNTA(U77:AX77)>0),\"OK\",\"N/E\")","v":"N/E"},null,null,null,null,null,null,null,null,null,null,null,null,null,null,null,null,null,null,null,null,null,null,null,null,null,null,null,null,null,null,null,{"$f":"IF(AND(CE$1<>\"\",COUNTA(U77:CD77)>1),\"OK\",\"N/E\")","v":"N/E"},null,null,null,null,null,null,null,null,null,null,null,null,null,null,null,null,null,null,null,null,null,null,null,null,null,null,null,null,null,null,null,{"$f":"IF(AND(DK$1<>\"\",COUNTA(U77:DJ77)>2),\"OK\",\"N/E\")","v":"N/E"},null,null,null,null,null,null,null,null,null,null,null,null,null,null,null,null,null,null,null,null,null,null,null,null,null,null,null,null,null,null,null,{"$f":"IF(AND(EQ$1<>\"\",COUNTA(U77:EP77)>3),\"OK\",\"N/E\")","v":"N/E"},null,null,null,null,null,null,null,null,null,null,null,null,null,null,null,null,null,null,null,null,null,null,null,null,null,null,null,null,null,null,null,{"$f":"IF(AND(FW$1<>\"\",COUNTA(U77:FV77)>4),\"OK\",\"N/E\")","v":"N/E"}]
[null,0,0.08,false,null,null,0,0,0,0,null,null,"Le système étudié est correctement mis en œuvre",0.08,null,null,null,null,null,null,null,null,null,null,null,null,null,null,null,null,null,null,null,null,null,null,null,null,null,null,null,null,null,null,null,null,null,null,null,null,"N/E",null,null,null,null,null,null,null,null,null,null,null,null,null,null,null,null,null,null,null,null,null,null,null,null,null,null,null,null,null,null,null,"N/E",null,null,null,null,null,null,null,null,null,null,null,null,null,null,null,null,null,null,null,null,null,null,null,null,null,null,null,null,null,null,null,"N/E",null,null,null,null,null,null,null,null,null,null,null,null,null,null,null,null,null,null,null,null,null,null,null,null,null,null,null,null,null,null,null,"N/E",null,null,null,null,null,null,null,null,null,null,null,null,null,null,null,null,null,null,null,null,null,null,null,null,null,null,null,null,null,null,null,"N/E"]
[null,0,0.08,false,null,null,0,0,0,0,null,null,"Les règles de sécurité sont connues et respectées",0.08,null,null,null,null,null,null,null,null,null,null,null,null,null,null,null,null,null,null,null,null,null,null,null,null,null,null,null,null,null,null,null,null,null,null,null,null,"N/E",null,null,null,null,null,null,null,null,null,null,null,null,null,null,null,null,null,null,null,null,null,null,null,null,null,null,null,null,null,null,null,"N/E",null,null,null,null,null,null,null,null,null,null,null,null,null,null,null,null,null,null,null,null,null,null,null,null,null,null,null,null,null,null,null,"N/E",null,null,null,null,null,null,null,null,null,null,null,null,null,null,null,null,null,null,null,null,null,null,null,null,null,null,null,null,null,null,null,"N/E",null,null,null,null,null,null,null,null,null,null,null,null,null,null,null,null,null,null,null,null,null,null,null,null,null,null,null,null,null,null,null,"N/E"]
[null,0,0.09,false,null,null,0,0,0,0,null,null,"Les résultats sont présentés clairement",0.09,null,null,null,null,null,null,null,null,null,null,null,null,null,null,null,null,null,null,null,null,null,null,null,null,null,null,null,null,null,null,null,null,null,null,null,null,"N/E",null,null,null,null,null,null,null,null,null,null,null,null,null,null,null,null,null,null,null,null,null,null,null,null,null,null,null,null,null,null,null,"N/E",null,null,null,null,null,null,null,null,null,null,null,null,null,null,null,null,null,null,null,null,null,null,null,null,null,null,null,null,null,null,null,"N/E",null,null,null,null,null,null,null,null,null,null,null,null,null,null,null,null,null,null,null,null,null,null,null,null,null,null,null,null,null,null,null,"N/E",null,null,null,null,null,null,null,null,null,null,null,null,null,null,null,null,null,null,null,null,null,null,null,null,null,null,null,null,null,null,null,"N/E"]
[null,0,0.1,false,null,null,0,0,0,0,null,null,"Les protocole d'essai est respecté",0.1,null,null,null,null,null,null,null,null,null,null,null,null,null,null,null,null,null,null,null,null,null,null,null,null,null,null,null,null,null,null,null,null,null,null,null,null,"N/E",null,null,null,null,null,null,null,null,null,null,null,null,null,null,null,null,null,null,null,null,null,null,null,null,null,null,null,null,null,null,null,"N/E",null,null,null,null,null,null,null,null,null,null,null,null,null,null,null,null,null,null,null,null,null,null,null,null,null,null,null,null,null,null,null,"N/E",null,null,null,null,null,null,null,null,null,null,null,null,null,null,null,null,null,null,null,null,null,null,null,null,null,null,null,null,null,null,null,"N/E",null,null,null,null,null,null,null,null,null,null,null,null,null,null,null,null,null,null,null,null,null,null,null,null,null,null,null,null,null,null,null,"N/E"]
[null,0,0.09,false,null,null,0,0,0,0,null,null,"Les méthodes et outils de traitement sont cohérents avec le problème posé",0.09,null,null,null,null,null,null,null,null,null,null,null,null,null,null,null,null,null,null,null,null,null,null,null,null,null,null,null,null,null,null,null,null,null,null,null,null,"N/E",null,null,null,null,null,null,null,null,null,null,null,null,null,null,null,null,null,null,null,null,null,null,null,null,null,null,null,null,null,null,null,"N/E",null,null,null,null,null,null,null,null,null,null,null,null,null,null,null,null,null,null,null,null,null,null,null,null,null,null,null,null,null,null,null,"N/E",null,null,null,null,null,null,null,null,null,null,null,null,null,null,null,null,null,null,null,null,null,null,null,null,null,null,null,null,null,null,null,"N/E",null,null,null,null,null,null,null,null,null,null,null,null,null,null,null,null,null,null,null,null,null,null,null,null,null,null,null,null,null,null,null,"N/E"]
[null,0,0.1,false,null,null,0,0,0,0,null,null,"Les résultats sont correctement analysés",0.1,null,null,null,null,null,null,null,null,null,null,null,null,null,null,null,null,null,null,null,null,null,null,null,null,null,null,null,null,null,null,null,null,null,null,null,null,">",null,null,null,null,null,null,null,null,null,null,null,null,null,null,null,null,null,null,null,null,null,null,null,null,null,null,null,null,null,null,null,">",null,null,null,null,null,null,null,null,null,null,null,null,null,null,null,null,null,null,null,null,null,null,null,null,null,null,null,null,null,null,null,">",null,null,null,null,null,null,null,null,null,null,null,null,null,null,null,null,null,null,null,null,null,null,null,null,null,null,null,null,null,null,null,">",null,null,null,null,null,null,null,null,null,null,null,null,null,null,null,null,null,null,null,null,null,null,null,null,null,null,null,null,null,null,null,">",{"$f":"IF(COUNTA(U83:FW83)>5,\"OK\",\"N/E\")","v":"N/E"}]
[null,null,null,false,null,null,null,null,null,null,null,"D","-  Communiquer",0.2]
[null,null,null,false,null,null,null,null,null,null,null,null,"D1 - Rechercher et traiter des informations : Rechercher des informations, analyser, choisir et classer des informations"]
[null,{"$f":"N86*D86*$N$84","v":0},{"$f":"IF(COUNTA(T86:CD86)<>0,N86,0)","v":0.1},false,null,null,0,0,0,0,null,null,"Les outils de recherche documentaire sont bien choisis",0.1,null,null,null,null,null,null,null,null,null,null,null,null,null,null,null,null,null,null,null,null,null,null,null,null,null,null,null,null,null,null,null,null,null,null,null,null,">",null,null,null,null,null,null,null,null,null,null,null,null,null,null,null,null,null,null,null,null,null,null,null,null,null,null,null,null,null,null,null,">",null,null,null,null,null,null,null,null,null,null,null,null,null,null,null,null,null,null,null,null,null,null,null,null,null,null,null,null,null,null,null,">",null,null,null,null,null,null,null,null,null,null,null,null,null,null,null,null,null,null,null,null,null,null,null,null,null,null,null,null,null,null,null,">",null,null,null,null,null,null,null,null,null,null,null,null,null,null,null,null,null,null,null,null,null,null,null,null,null,null,null,null,null,null,null,">",{"$f":"IF(COUNTA(U86:FW86)>5,\"OK\",\"N/E\")","v":"N/E"}]
[null,{"$f":"N87*D87*$N$84","v":0},{"$f":"IF(COUNTA(T87:CD87)<>0,N87,0)","v":0.05},false,null,null,0,0,0,0,null,null,"Les techniques de recherche documentaire sont maîtrisées",0.05,null,null,null,null,null,null,null,null,null,null,null,null,null,null,null,null,null,null,null,null,null,null,null,null,null,null,null,null,null,null,null,null,null,null,null,null,">",null,null,null,null,null,null,null,null,null,null,null,null,null,null,null,null,null,null,null,null,null,null,null,null,null,null,null,null,null,null,null,">",null,null,null,null,null,null,null,null,null,null,null,null,null,null,null,null,null,null,null,null,null,null,null,null,null,null,null,null,null,null,null,">",null,null,null,null,null,null,null,null,null,null,null,null,null,null,null,null,null,null,null,null,null,null,null,null,null,null,null,null,null,null,null,">",null,null,null,null,null,null,null,null,null,null,null,null,null,null,null,null,null,null,null,null,null,null,null,null,null,null,null,null,null,null,null,">",{"$f":"IF(COUNTA(U87:FW87)>5,\"OK\",\"N/E\")","v":"N/E"}]
[null,{"$f":"N88*D88*$N$84","v":0},{"$f":"IF(COUNTA(T88:CD88)<>0,N88,0)","v":0.05},false,null,null,0,0,0,0,null,null,"Les informations conservées sont opportunes",0.05,null,null,null,null,null,null,null,null,null,null,null,null,null,null,null,null,null,null,null,null,null,null,null,null,null,null,null,null,null,null,null,null,null,null,null,null,">",null,null,null,null,null,null,null,null,null,null,null,null,null,null,null,null,null,null,null,null,null,null,null,null,null,null,null,null,null,null,null,">",null,null,null,null,null,null,null,null,null,null,null,null,null,null,null,null,null,null,null,null,null,null,null,null,null,null,null,null,null,null,null,">",null,null,null,null,null,null,null,null,null,null,null,null,null,null,null,null,null,null,null,null,null,null,null,null,null,null,null,null,null,null,null,">",null,null,null,null,null,null,null,null,null,null,null,null,null,null,null,null,null,null,null,null,null,null,null,null,null,null,null,null,null,null,null,">",{"$f":"IF(COUNTA(U88:FW88)>5,\"OK\",\"N/E\")","v":"N/E"}]
[null,{"$f":"N89*D89*$N$84","v":0},{"$f":"IF(COUNTA(T89:CD89)<>0,N89,0)","v":0.1},false,null,null,0,0,0,0,null,null,"Le classement des données permet de les retrouver rapidement",0.1,null,null,null,null,null,null,null,null,null,null,null,null,null,null,null,null,null,null,null,null,null,null,null,null,null,null,null,null,null,null,null,null,null,null,null,null,">",null,null,null,null,null,null,null,null,null,null,null,null,null,null,null,null,null,null,null,null,null,null,null,null,null,null,null,null,null,null,null,">",null,null,null,null,null,null,null,null,null,null,null,null,null,null,null,null,null,null,null,null,null,null,null,null,null,null,null,null,null,null,null,">",null,null,null,null,null,null,null,null,null,null,null,null,null,null,null,null,null,null,null,null,null,null,null,null,null,null,null,null,null,null,null,">",null,null,null,null,null,null,null,null,null,null,null,null,null,null,null,null,null,null,null,null,null,null,null,null,null,null,null,null,null,null,null,">",{"$f":"IF(COUNTA(U89:FW89)>5,\"OK\",\"N/E\")","v":"N/E"}]
[null,null,null,false,null,null,null,null,null,null,null,null,"D2 - Mettre en œuvre une communication : Choisir un support de communication et un média adapté, argumenter, produire un support de communication et adapter sa stratégie de communication au contexte"]
[null,{"$f":"N91*D91*$N$84","v":0},{"$f":"IF(COUNTA(T91:CD91)<>0,N91,0)","v":0.2},false,null,null,0,0,0,0,null,null,"Les outils de communication sont maîtrisés",0.2,null,null,null,null,null,null,null,null,null,null,null,null,null,null,null,null,null,null,null,null,null,null,null,null,null,null,null,null,null,null,null,null,null,null,null,null,">",null,null,null,null,null,null,null,null,null,null,null,null,null,null,null,null,null,null,null,null,null,null,null,null,null,null,null,null,null,null,null,">",null,null,null,null,null,null,null,null,null,null,null,null,null,null,null,null,null,null,null,null,null,null,null,null,null,null,null,null,null,null,null,">",null,null,null,null,null,null,null,null,null,null,null,null,null,null,null,null,null,null,null,null,null,null,null,null,null,null,null,null,null,null,null,">",null,null,null,null,null,null,null,null,null,null,null,null,null,null,null,null,null,null,null,null,null,null,null,null,null,null,null,null,null,null,null,">",{"$f":"IF(COUNTA(U91:FW91)>5,\"OK\",\"N/E\")","v":"N/E"}]
[null,{"$f":"N92*D92*$N$84","v":0},{"$f":"IF(COUNTA(T92:CD92)<>0,N92,0)","v":0.1},false,null,null,0,0,0,0,null,null,"Le support utilisé est adapté",0.1,null,null,null,null,null,null,null,null,null,null,null,null,null,null,null,null,null,null,null,null,null,null,null,null,null,null,null,null,null,null,null,null,null,null,null,null,">",null,null,null,null,null,null,null,null,null,null,null,null,null,null,null,null,null,null,null,null,null,null,null,null,null,null,null,null,null,null,null,">",null,null,null,null,null,null,null,null,null,null,null,null,null,null,null,null,null,null,null,null,null,null,null,null,null,null,null,null,null,null,null,">",null,null,null,null,null,null,null,null,null,null,null,null,null,null,null,null,null,null,null,null,null,null,null,null,null,null,null,null,null,null,null,">",null,null,null,null,null,null,null,null,null,null,null,null,null,null,null,null,null,null,null,null,null,null,null,null,null,null,null,null,null,null,null,">",{"$f":"IF(COUNTA(U92:FW92)>5,\"OK\",\"N/E\")","v":"N/E"}]
[null,{"$f":"N93*D93*$N$84","v":0},{"$f":"IF(COUNTA(T93:CD93)<>0,N93,0)","v":0.2},false,null,null,0,0,0,0,null,null,"La production finale permet la compréhension du problème et de sa résolution ",0.2,null,null,null,null,null,null,null,null,null,null,null,null,null,null,null,null,null,null,null,null,null,null,null,null,null,null,null,null,null,null,null,null,null,null,null,null,">",null,null,null,null,null,null,null,null,null,null,null,null,null,null,null,null,null,null,null,null,null,null,null,null,null,null,null,null,null,null,null,">",null,null,null,null,null,null,null,null,null,null,null,null,null,null,null,null,null,null,null,null,null,null,null,null,null,null,null,null,null,null,null,">",null,null,null,null,null,null,null,null,null,null,null,null,null,null,null,null,null,null,null,null,null,null,null,null,null,null,null,null,null,null,null,">",null,null,null,null,null,null,null,null,null,null,null,null,null,null,null,null,null,null,null,null,null,null,null,null,null,null,null,null,null,null,null,">",{"$f":"IF(COUNTA(U93:FW93)>5,\"OK\",\"N/E\")","v":"N/E"}]
[null,{"$f":"N94*D94*$N$84","v":0},{"$f":"IF(COUNTA(T94:CD94)<>0,N94,0)","v":0.2},false,null,null,0,0,0,0,null,null,"La production respecte le cahier des charges (écrit/oral, texte/vidéo, durée, public visé, …)",0.2,null,null,null,null,null,null,null,null,null,null,null,null,null,null,null,null,null,null,null,null,null,null,null,null,null,null,null,null,null,null,null,null,null,null,null,null,">",null,null,null,null,null,null,null,null,null,null,null,null,null,null,null,null,null,null,null,null,null,null,null,null,null,null,null,null,null,null,null,">",null,null,null,null,null,null,null,null,null,null,null,null,null,null,null,null,null,null,null,null,null,null,null,null,null,null,null,null,null,null,null,">",null,null,null,null,null,null,null,null,null,null,null,null,null,null,null,null,null,null,null,null,null,null,null,null,null,null,null,null,null,null,null,">",null,null,null,null,null,null,null,null,null,null,null,null,null,null,null,null,null,null,null,null,null,null,null,null,null,null,null,null,null,null,null,">",{"$f":"IF(COUNTA(U94:FW94)>5,\"OK\",\"N/E\")","v":"N/E"}]
[null,null,null,{"$f":"IF($B$1>2,TRUE,FALSE)","v":true}]
[null,null,null,{"$f":"IF($B$1>2,TRUE,FALSE)","v":true},null,null,null,null,null,null,null,null,"Evaluation en cours d'année"]
[null,null,null,{"$f":"IF($B$1>2,TRUE,FALSE)","v":true},null,null,null,null,null,null,null,null,"Soutenance finale"]

{"sheet":"Elève B","index":4,"n_rows":97,"n_cols":180,"rows_kept":97,"cut":false,"hidden":false,"merged":[]}
[null,{"$f":"parametres!G3","v":4},null,true,null,null,"IR_t","IR_e","IS_t","IS_e",null,null,{"$f":"CONCATENATE(\"B : \",Synthèse!E22,\" \",Synthèse!F22)","v":"B : eleve B "},null,null,{"$f":"IF($B$2<>0,H2/G2,\"X\")","v":0.78723404255319152},{"$f":"IF($B$2<>0,J2/I2,\"X\")","v":0.54545454545454541},{"$f":"IF($B$2<>0,(H2+J2)/(G2+I2),0)","v":0.6875},null,{"$f":"TRANSPOSE('Déclinaison projet'!V10:V170)","v":""},"Compléter l’analyse fonctionnelle du système existant","Compléter l’analyse fonctionnelle du système modifié","Compléter le diagramme d’organisation des tâches (WBS)","Compléter le planning et le faire vivre ( diagramme de GANTT)","S'approprier le CDCF ( avec le client éventuellement )","Structurer le travail de groupe ( identifier les découpages possibles)","","","","","","","","","","","","","","","","","","","","","","","","","","","Analyse de la chaine d'énergie du système Fitlux","Evaluer la prodcution d'énergie de la génératrice","Effectuer un bilan de puissance des besoins","","","Evaluer la production d'énergie de 10 m² de panneaux","","","","","","","","","","","","","","","","","","","","","","","","","REVUE DE PROJET - Conception préliminaire","","","Détermination du schéma électrique des structures matérielles assurant la communication Wifi","","Concevoir un réseau WIFI sur Packet Tracer","","","Chiffrer le projet par un devis","Préparer le bon de commande des matériels","","","","","","","","","","","","","","","","","","","","","","","REVUE DE PROJET - Conception détaillée","","","Câblage des structures matérielles assurant la communication WIFI","Configuer le réseau Wifi","","","Créer une struture du prototype","","Esthétique du prototype","","","","","","","","","","","","","","","","","","","","","","","REVUE DE PROJET - Réalisation","","","","Validation du fonctionnement du réseau WIFI sur un PC","","","Piloter le projet ( communiquer … )","Validation des performances / remedier ","","","","","","","","","","","","","","","","","","","","","","","","REVUE DE PROJET - Validation","SOUTENANCE FINALE DU PROJET"]
[null,{"$f":"SUM(B4:B94)","v":80},null,true,null,null,{"$f":"SUM(G4:G94)","v":47},{"$f":"SUM(H4:H94)","v":37},{"$f":"SUM(I4:I94)","v":33},{"$f":"SUM(J4:J94)","v":18},null,null,null,null,null,"Tx Indic. REVUES","Tx Indic. SOUTEN.","Taux Global"]
[]
[null,null,null,{"$f":"IF($B$1>2,TRUE,FALSE)","v":true},null,null,null,null,null,null,null,null,"O1 -  Caractériser des systèmes privilégiant un usage raisonné du point de vue développement durable"]
[null,{"$f":"N5*D5","v":5},{"$f":"IF(FX5=\"OK\",N5,0)","v":0},true,null,null,{"$f":"IF($FX5=\"\",$B5,0)","v":0},{"$f":"IF(OR($AY5=\"OK\",$CE5=\"OK\",$DK5=\"OK\",$EQ5=\"OK\",$FW5=\"OK\"),$B5,0)","v":0},{"$f":"IF($FX5=\"\",0,$B5)","v":5},{"$f":"IF($FX5=\"OK\",$B5,0)","v":0},null,null,"CO1.1. Justifier les choix des matériaux, des structures d’un système et les énergies mises en oeuvre dans une approche de développement durable",5,null,null,null,null,null,null,null,null,null,null,null,null,null,null,null,null,null,null,null,null,null,null,null,null,null,null,null,null,null,null,null,null,null,null,null,null,">",null,null,null,null,null,null,null,null,null,null,null,null,null,null,null,null,null,null,null,null,null,null,null,null,null,null,null,null,null,null,null,">",null,null,null,null,null,null,null,null,null,null,null,null,null,null,null,null,null,null,null,null,null,null,null,null,null,null,null,null,null,null,null,">",null,null,null,null,null,null,null,null,null,null,null,null,null,null,null,null,null,null,null,null,null,null,null,null,null,null,null,null,null,null,null,">",null,null,null,null,null,null,null,null,null,null,null,null,null,null,null,null,null,null,null,null,null,null,null,null,null,null,null,null,null,null,null,">",{"$f":"IF(COUNTA(U5:FW5)>5,\"OK\",\"N/E\")","v":"N/E"}]
[null,3,{"$f":"IF(FX6=\"OK\",N6,0)","v":3},true,null,null,{"$f":"IF($FX6=\"\",$B6,0)","v":0},{"$f":"IF(OR($AY6=\"OK\",$CE6=\"OK\",$DK6=\"OK\",$EQ6=\"OK\",$FW6=\"OK\"),$B6,0)","v":0},{"$f":"IF($FX6=\"\",0,$B6)","v":3},{"$f":"IF($FX6=\"OK\",$B6,0)","v":3},null,null,"CO1.2. Justifier le choix d’une solution selon des contraintes d’ergonomie et d’effets sur la santé de l’homme et du vivant",3,null,null,null,null,null,null,null,null,null,null,null,null,null,null,null,null,null,null,null,null,null,null,null,null,null,null,null,null,null,null,null,null,null,null,null,null,">",null,null,null,null,null,null,null,null,null,null,null,null,null,null,null,null,null,null,null,null,null,null,null,null,null,null,null,null,null,null,null,">",null,null,"x",null,null,null,null,null,null,null,null,null,null,null,null,null,null,null,null,null,null,null,null,null,null,null,null,null,null,null,null,">",null,null,null,null,null,null,null,null,null,null,null,null,null,null,null,null,null,null,null,null,null,null,null,null,null,null,null,null,null,null,null,">",null,null,null,null,null,null,null,null,null,null,null,null,null,null,null,null,null,null,null,null,null,null,null,null,null,null,null,null,null,null,null,">",{"$f":"IF(COUNTA(U6:FW6)>5,\"OK\",\"N/E\")","v":"OK"}]
[null,null,null,true,null,null,null,null,null,null,null,null,"O2 - Identifier les éléments permettant la limitation de l’Impact environnemental d’un système et de ses constituants"]
[null,4,{"$f":"IF(FX8=\"OK\",N8,0)","v":4},true,null,null,0,0,4,4,null,null,"CO2.1. Identifier les flux et la forme de l’énergie, caractériser ses transformations et/ou modulations et estimer l’efficacité énergétique globale d’un système",4,null,null,null,null,null,null,null,null,null,null,null,null,null,null,null,null,null,null,null,null,null,null,null,null,null,null,null,null,null,null,null,null,null,null,null,null,">",null,"x",null,null,null,null,null,null,null,null,null,null,null,null,null,null,null,null,null,null,null,null,null,null,null,null,null,null,null,null,null,">",null,null,null,null,null,null,null,null,null,null,null,null,null,null,null,null,null,null,null,null,null,null,null,null,null,null,null,null,null,null,null,">",null,null,null,null,null,null,null,null,null,null,null,null,null,null,null,null,null,null,null,null,null,null,null,null,null,null,null,null,null,null,null,">",null,null,null,null,null,null,null,null,null,null,null,null,null,null,null,null,null,null,null,null,null,null,null,null,null,null,null,null,null,null,null,">",{"$f":"IF(COUNTA(U8:FW8)>5,\"OK\",\"N/E\")","v":"OK"}]
[null,5,{"$f":"IF(FX9=\"OK\",N9,0)","v":0},true,null,null,0,0,5,0,null,null,"CO2.2. Justifier les solutions constructives d’un système au regard des impacts environnementaux et économiques engendrés tout au long de son cycle de vie",5,null,null,null,null,null,null,null,null,null,null,null,null,null,null,null,null,null,null,null,null,null,null,null,null,null,null,null,null,null,null,null,null,null,null,null,null,">",null,null,null,null,null,null,null,null,null,null,null,null,null,null,null,null,null,null,null,null,null,null,null,null,null,null,null,null,null,null,null,">",null,null,null,null,null,null,null,null,null,null,null,null,null,null,null,null,null,null,null,null,null,null,null,null,null,null,null,null,null,null,null,">",null,null,null,null,null,null,null,null,null,null,null,null,null,null,null,null,null,null,null,null,null,null,null,null,null,null,null,null,null,null,null,">",null,null,null,null,null,null,null,null,null,null,null,null,null,null,null,null,null,null,null,null,null,null,null,null,null,null,null,null,null,null,null,">",{"$f":"IF(COUNTA(U9:FW9)>5,\"OK\",\"N/E\")","v":"N/E"}]
[null,null,null,true,null,null,null,null,null,null,null,null,"O6 - Communiquer une idée, un principe ou une solution technique, un projet, y compris en langue étrangère"]
[null,3,{"$f":"IF(FX11=\"OK\",N11,0)","v":3},true,null,null,0,0,3,3,null,null,"CO6.1. Décrire une idée, un principe, une solution, un projet en utilisant des outils de représentation adaptés",3,null,null,null,null,null,null,null,null,"x",null,null,null,null,null,null,null,null,null,null,null,null,null,null,null,null,null,null,null,null,null,null,null,null,null,null,null,">",null,null,null,null,null,null,null,null,null,null,null,null,null,null,null,null,null,null,null,null,null,null,null,null,null,null,null,null,null,null,null,">",null,null,null,null,null,null,null,null,null,null,null,null,null,null,null,null,null,null,null,null,null,null,null,null,null,null,null,null,null,null,null,">",null,null,null,null,null,null,null,null,null,null,null,null,null,null,null,null,null,null,null,null,null,null,null,null,null,null,null,null,null,null,null,">",null,null,null,null,null,null,null,null,null,null,null,null,null,null,null,null,null,null,null,null,null,null,null,null,null,null,null,null,null,null,null,">",{"$f":"IF(COUNTA(U11:FW11)>5,\"OK\",\"N/E\")","v":"OK"}]
[null,3,{"$f":"IF(FX12=\"OK\",N12,0)","v":3},true,null,null,0,0,3,3,null,null,"CO6.2. Décrire le fonctionnement et/ou l’exploitation d’un système en utilisant l'outil de description le plus pertinent",3,null,null,null,null,null,null,null,null,null,"x",null,null,null,null,null,null,null,null,null,null,null,null,null,null,null,null,null,null,null,null,null,null,null,null,null,null,">",null,null,null,null,null,null,null,null,null,null,null,null,null,null,null,null,null,null,null,null,null,null,null,null,null,null,null,null,null,null,null,">",null,null,null,null,null,null,null,null,null,null,null,null,null,null,null,null,null,null,null,null,null,null,null,null,null,null,null,null,null,null,null,">",null,null,null,null,null,null,null,null,null,null,null,null,null,null,null,null,null,null,null,null,null,null,null,null,null,null,null,null,null,null,null,">",null,null,null,null,null,null,null,null,null,null,null,null,null,null,null,null,null,null,null,null,null,null,null,null,null,null,null,null,null,null,null,">",{"$f":"IF(COUNTA(U12:FW12)>5,\"OK\",\"N/E\")","v":"OK"}]
[null,5,{"$f":"IF(FX13=\"OK\",N13,0)","v":5},true,null,null,0,0,5,5,null,null,"CO6.3. Présenter et argumenter des démarches, des résultats, y compris dans une langue étrangère",5,null,null,null,null,null,null,null,null,null,null,null,null,null,null,null,null,null,null,null,null,null,null,null,null,null,null,null,null,null,null,null,null,null,null,null,null,">",null,null,null,null,null,null,null,null,null,null,null,null,null,null,null,null,null,null,null,null,null,null,null,null,null,null,null,null,null,null,null,">",null,null,null,null,null,null,null,null,null,null,null,null,null,null,null,null,null,null,null,null,null,null,null,null,null,null,null,null,null,null,null,">",null,null,null,null,null,null,null,null,null,null,null,null,null,null,null,null,null,null,null,null,null,null,null,null,null,null,null,null,null,null,null,">",null,null,"x",null,null,null,null,"x",null,null,null,null,null,null,null,null,null,null,null,null,null,null,null,null,null,null,null,null,null,null,null,">",{"$f":"IF(COUNTA(U13:FW13)>5,\"OK\",\"N/E\")","v":"OK"}]
[null,null,null,true,null,null,null,null,null,null,null,null,"O7 -  Imaginer une solution, répondre à un besoin"]
[null,0,{"$f":"IF(OR(CE15=\"OK\",EQ15=\"OK\"),N15,0)","v":0},{"$f":"IF($B$1=3,TRUE,FALSE)","v":false},null,null,0,0,0,0,null,null,"CO7.ac1. Participer à une étude architecturale, dans une démarche de développement durable",5,null,null,null,null,null,null,null,null,null,null,null,null,null,null,null,null,null,null,null,null,null,null,null,null,null,null,null,null,null,null,null,null,null,null,null,null,{"$f":"IF(AND(AY$1<>\"\",COUNTA(U15:AX15)>0),\"OK\",\"N/E\")","v":"N/E"},null,null,null,null,null,null,null,null,null,null,null,null,null,null,null,null,null,null,null,null,null,null,null,null,null,null,null,null,null,null,null,{"$f":"IF(AND(CE$1<>\"\",COUNTA(U15:CD15)>1),\"OK\",\"N/E\")","v":"N/E"},null,null,null,null,null,null,null,null,null,null,null,null,null,null,null,null,null,null,null,null,null,null,null,null,null,null,null,null,null,null,null,{"$f":"IF(AND(DK$1<>\"\",COUNTA(U15:DJ15)>2),\"OK\",\"N/E\")","v":"N/E"},null,null,null,null,null,null,null,null,null,null,null,null,null,null,null,null,null,null,null,null,null,null,null,null,null,null,null,null,null,null,null,{"$f":"IF(AND(EQ$1<>\"\",COUNTA(U15:EP15)>3),\"OK\",\"N/E\")","v":"N/E"},null,null,null,null,null,null,null,null,null,null,null,null,null,null,null,null,null,null,null,null,null,null,null,null,null,null,null,null,null,null,null,{"$f":"IF(AND(FW$1<>\"\",COUNTA(U15:FV15)>4),\"OK\",\"N/E\")","v":"N/E"}]
[null,0,0,{"$f":"IF($B$1=3,TRUE,FALSE)","v":false},null,null,0,0,0,0,null,null,"CO7.ac2. Proposer/choisir des solutions techniques répondant aux contraintes et attentes d’une construction",7,null,null,null,null,null,null,null,null,null,null,null,null,null,null,null,null,null,null,null,null,null,null,null,null,null,null,null,null,null,null,null,null,null,null,null,null,{"$f":"IF(AND(AY$1<>\"\",COUNTA(U16:AX16)>0),\"OK\",\"N/E\")","v":"N/E"},null,null,null,null,null,null,null,null,null,null,null,null,null,null,null,null,null,null,null,null,null,null,null,null,null,null,null,null,null,null,null,{"$f":"IF(AND(CE$1<>\"\",COUNTA(U16:CD16)>1),\"OK\",\"N/E\")","v":"N/E"},null,null,null,null,null,null,null,null,null,null,null,null,null,null,null,null,null,null,null,null,null,null,null,null,null,null,null,null,null,null,null,{"$f":"IF(AND(DK$1<>\"\",COUNTA(U16:DJ16)>2),\"OK\",\"N/E\")","v":"N/E"},null,null,null,null,null,null,null,null,null,null,null,null,null,null,null,null,null,null,null,null,null,null,null,null,null,null,null,null,null,null,null,{"$f":"IF(AND(EQ$1<>\"\",COUNTA(U16:EP16)>3),\"OK\",\"N/E\")","v":"N/E"},null,null,null,null,null,null,null,null,null,null,null,null,null,null,null,null,null,null,null,null,null,null,null,null,null,null,null,null,null,null,null,{"$f":"IF(AND(FW$1<>\"\",COUNTA(U16:FV16)>4),\"OK\",\"N/E\")","v":"N/E"}]
[null,0,0,{"$f":"IF($B$1=3,TRUE,FALSE)","v":false},null,null,0,0,0,0,null,null,"CO7.ac3. Concevoir une organisation de réalisation",4,null,null,null,null,null,null,null,null,null,null,null,null,null,null,null,null,null,null,null,null,null,null,null,null,null,null,null,null,null,null,null,null,null,null,null,null,"N/E",null,null,null,null,null,null,null,null,null,null,null,null,null,null,null,null,null,null,null,null,null,null,null,null,null,null,null,null,null,null,null,"N/E",null,null,null,null,null,null,null,null,null,null,null,null,null,null,null,null,null,null,null,null,null,null,null,null,null,null,null,null,null,null,null,"N/E",null,null,null,null,null,null,null,null,null,null,null,null,null,null,null,null,null,null,null,null,null,null,null,null,null,null,null,null,null,null,null,"N/E",null,null,null,null,null,null,null,null,null,null,null,null,null,null,null,null,null,null,null,null,null,null,null,null,null,null,null,null,null,null,null,"N/E"]
[null,7,7,{"$f":"IF($B$1=4,TRUE,FALSE)","v":true},null,null,7,7,0,0,null,null,"CO7.ee1. Participer à une démarche de conception dans le but de proposer plusieurs solutions possibles à un problème technique identifié en lien avec un enjeu énergétique",7,null,null,null,null,null,null,null,null,null,null,null,null,null,null,null,null,null,null,null,null,null,null,null,null,null,null,null,null,null,null,null,null,null,null,null,null,"N/E",null,null,null,null,null,"x",null,null,null,null,null,null,null,null,null,null,null,null,null,null,null,null,null,null,null,null,null,null,null,null,null,"OK",null,null,null,null,null,null,null,null,null,null,null,null,null,null,null,null,null,null,null,null,null,null,null,null,null,null,null,null,null,null,null,"OK",null,null,null,null,null,null,null,null,null,null,null,null,null,null,null,null,null,null,null,null,null,null,null,null,null,null,null,null,null,null,null,"OK",null,null,null,null,null,null,null,null,null,null,null,null,null,null,null,null,null,null,null,null,null,null,null,null,null,null,null,null,null,null,null,"OK"]
[null,6,6,{"$f":"IF($B$1=4,TRUE,FALSE)","v":true},null,null,6,6,0,0,null,null,"CO7.ee2. Justifier une solution retenue en intégrant les conséquences des choix sur le triptyque matériau-énergie-information",6,null,null,null,null,null,null,null,null,null,null,null,null,null,null,null,null,null,null,null,null,null,null,null,null,null,null,null,null,null,null,null,null,null,null,null,null,"N/E",null,null,null,null,null,"x",null,null,null,null,null,null,null,null,null,null,null,null,null,null,null,null,null,null,null,null,null,null,null,null,null,"OK",null,null,"x",null,null,null,null,"x",null,null,null,null,null,null,null,null,null,null,null,null,null,null,null,null,null,null,null,null,null,null,null,"OK",null,null,null,null,null,null,null,null,null,null,null,null,null,null,null,null,null,null,null,null,null,null,null,null,null,null,null,null,null,null,null,"OK",null,null,null,null,null,null,null,null,null,null,null,null,null,null,null,null,null,null,null,null,null,null,null,null,null,null,null,null,null,null,null,"OK"]
[null,4,4,{"$f":"IF($B$1=4,TRUE,FALSE)","v":true},null,null,4,4,0,0,null,null,"CO7.ee3. Définir la structure, la constitution d’un système en fonction des caractéristiques technico-économiques et environnementales attendues",4,null,null,null,null,null,null,null,null,null,null,null,null,null,null,null,null,null,null,null,null,null,null,null,null,null,null,null,null,null,null,null,null,null,null,null,null,"N/E",null,null,null,null,null,"x",null,null,null,null,null,null,null,null,null,null,null,null,null,null,null,null,null,null,null,null,null,null,null,null,null,"OK",null,null,"x",null,null,null,null,"x",null,null,null,null,null,null,null,null,null,null,null,null,null,null,null,null,null,null,null,null,null,null,null,"OK",null,null,null,null,null,null,null,null,null,null,null,null,null,null,null,null,null,null,null,null,null,null,null,null,null,null,null,null,null,null,null,"OK",null,null,null,null,null,null,null,null,null,null,null,null,null,null,null,null,null,null,null,null,null,null,null,null,null,null,null,null,null,null,null,"OK"]
[null,4,4,{"$f":"IF($B$1=4,TRUE,FALSE)","v":true},null,null,4,4,0,0,null,null,"CO7.ee4. Définir les modifications de la structure, les choix de constituants et du type de système de gestion d'une chaîne d’énergie afin de répondre à une évolution d’un cahier des charges",4,null,null,null,null,null,null,null,null,null,null,null,null,null,null,null,null,null,null,null,null,null,null,null,null,null,null,null,null,null,null,null,null,null,null,null,null,"N/E",null,null,null,null,null,"x",null,null,null,null,null,null,null,null,null,null,null,null,null,null,null,null,null,null,null,null,null,null,null,null,null,"OK",null,null,"x",null,null,null,null,"x",null,null,null,null,null,null,null,null,null,null,null,null,null,null,null,null,null,null,null,null,null,null,null,"OK",null,null,null,null,null,null,null,null,null,null,null,null,null,null,null,null,null,null,null,null,null,null,null,null,null,null,null,null,null,null,null,"OK",null,null,null,null,null,null,null,null,null,null,null,null,null,null,null,null,null,null,null,null,null,null,null,null,null,null,null,null,null,null,null,"OK"]
[null,0,0,{"$f":"IF($B$1=5,TRUE,FALSE)","v":false},null,null,0,0,0,0,null,null,"CO7.itec1. Identifier et justifier un problème technique à partir de l’analyse globale d’un système (approche matière-énergie-information)",5,null,null,null,null,null,null,null,null,null,null,null,null,null,null,null,null,null,null,null,null,null,null,null,null,null,null,null,null,null,null,null,null,null,null,null,null,"N/E",null,null,null,null,null,null,null,null,null,null,null,null,null,null,null,null,null,null,null,null,null,null,null,null,null,null,null,null,null,null,null,"N/E",null,null,null,null,null,null,null,null,null,null,null,null,null,null,null,null,null,null,null,null,null,null,null,null,null,null,null,null,null,null,null,"N/E",null,null,null,null,null,null,null,null,null,null,null,null,null,null,null,null,null,null,null,null,null,null,null,null,null,null,null,null,null,null,null,"N/E",null,null,null,null,null,null,null,null,null,null,null,null,null,null,null,null,null,null,null,null,null,null,null,null,null,null,null,null,null,null,null,"N/E"]
[null,0,0,{"$f":"IF($B$1=5,TRUE,FALSE)","v":false},null,null,0,0,0,0,null,null,"CO7.itec2. Proposer des solutions à un problème technique identifié en participant à des démarches de créativité, choisir et justifier la solution retenue",6,null,null,null,null,null,null,null,null,null,null,null,null,null,null,null,null,null,null,null,null,null,null,null,null,null,null,null,null,null,null,null,null,null,null,null,null,"N/E",null,null,null,null,null,null,null,null,null,null,null,null,null,null,null,null,null,null,null,null,null,null,null,null,null,null,null,null,null,null,null,"N/E",null,null,null,null,null,null,null,null,null,null,null,null,null,null,null,null,null,null,null,null,null,null,null,null,null,null,null,null,null,null,null,"N/E",null,null,null,null,null,null,null,null,null,null,null,null,null,null,null,null,null,null,null,null,null,null,null,null,null,null,null,null,null,null,null,"N/E",null,null,null,null,null,null,null,null,null,null,null,null,null,null,null,null,null,null,null,null,null,null,null,null,null,null,null,null,null,null,null,"N/E"]
[null,0,0,{"$f":"IF($B$1=5,TRUE,FALSE)","v":false},null,null,0,0,0,0,null,null,"CO7.itec3. Définir, à l’aide d’un modeleur numérique, les formes et dimensions d'une pièce d'un mécanisme à partir des contraintes fonctionnelles, de son principe de réalisation et de son matériau",3,null,null,null,null,null,null,null,null,null,null,null,null,null,null,null,null,null,null,null,null,null,null,null,null,null,null,null,null,null,null,null,null,null,null,null,null,"N/E",null,null,null,null,null,null,null,null,null,null,null,null,null,null,null,null,null,null,null,null,null,null,null,null,null,null,null,null,null,null,null,"N/E",null,null,null,null,null,null,null,null,null,null,null,null,null,null,null,null,null,null,null,null,null,null,null,null,null,null,null,null,null,null,null,"N/E",null,null,null,null,null,null,null,null,null,null,null,null,null,null,null,null,null,null,null,null,null,null,null,null,null,null,null,null,null,null,null,"N/E",null,null,null,null,null,null,null,null,null,null,null,null,null,null,null,null,null,null,null,null,null,null,null,null,null,null,null,null,null,null,null,"N/E"]
[null,0,0,{"$f":"IF($B$1=5,TRUE,FALSE)","v":false},null,null,0,0,0,0,null,null,"CO7.itec4. Définir, à l’aide d’un modeleur numérique, les modifications d'un mécanisme à partir des contraintes fonctionnelles",2,null,null,null,null,null,null,null,null,null,null,null,null,null,null,null,null,null,null,null,null,null,null,null,null,null,null,null,null,null,null,null,null,null,null,null,null,"N/E",null,null,null,null,null,null,null,null,null,null,null,null,null,null,null,null,null,null,null,null,null,null,null,null,null,null,null,null,null,null,null,"N/E",null,null,null,null,null,null,null,null,null,null,null,null,null,null,null,null,null,null,null,null,null,null,null,null,null,null,null,null,null,null,null,"N/E",null,null,null,null,null,null,null,null,null,null,null,null,null,null,null,null,null,null,null,null,null,null,null,null,null,null,null,null,null,null,null,"N/E",null,null,null,null,null,null,null,null,null,null,null,null,null,null,null,null,null,null,null,null,null,null,null,null,null,null,null,null,null,null,null,"N/E"]
[null,0,0,{"$f":"IF($B$1=6,TRUE,FALSE)","v":false},null,null,0,0,0,0,null,null,"CO7.sin1. Décoder la notice technique d’un système, vérifier la conformité du fonctionnement",4,null,null,null,null,null,null,null,null,null,null,null,null,null,null,null,null,null,null,null,null,null,null,null,null,null,null,null,null,null,null,null,null,null,null,null,null,"N/E",null,null,null,null,null,null,null,null,null,null,null,null,null,null,null,null,null,null,null,null,null,null,null,null,null,null,null,null,null,null,null,"N/E",null,null,null,null,null,null,null,null,null,null,null,null,null,null,null,null,null,null,null,null,null,null,null,null,null,null,null,null,null,null,null,"N/E",null,null,null,null,null,null,null,null,null,null,null,null,null,null,null,null,null,null,null,null,null,null,null,null,null,null,null,null,null,null,null,"N/E",null,null,null,null,null,null,null,null,null,null,null,null,null,null,null,null,null,null,null,null,null,null,null,null,null,null,null,null,null,null,null,"N/E"]
[null,0,0,{"$f":"IF($B$1=6,TRUE,FALSE)","v":false},null,null,0,0,0,0,null,null,"CO7.sin2. Décoder le cahier des charges fonctionnel décrivant le besoin exprimé, identifier la fonction définie par un besoin exprimé, faire des mesures pour caractériser cette fonction et conclure sur sa conformité",5,null,null,null,null,null,null,null,null,null,null,null,null,null,null,null,null,null,null,null,null,null,null,null,null,null,null,null,null,null,null,null,null,null,null,null,null,"N/E",null,null,null,null,null,null,null,null,null,null,null,null,null,null,null,null,null,null,null,null,null,null,null,null,null,null,null,null,null,null,null,"N/E",null,null,null,null,null,null,null,null,null,null,null,null,null,null,null,null,null,null,null,null,null,null,null,null,null,null,null,null,null,null,null,"N/E",null,null,null,null,null,null,null,null,null,null,null,null,null,null,null,null,null,null,null,null,null,null,null,null,null,null,null,null,null,null,null,"N/E",null,null,null,null,null,null,null,null,null,null,null,null,null,null,null,null,null,null,null,null,null,null,null,null,null,null,null,null,null,null,null,"N/E"]
[null,0,0,{"$f":"IF($B$1=6,TRUE,FALSE)","v":false},null,null,0,0,0,0,null,null,"CO7.sin3. Exprimer le principe de fonctionnement d’un système à partir des diagrammes SysML pertinents Repérer les constituants de la chaîne d’énergie et d’information",4,null,null,null,null,null,null,null,null,null,null,null,null,null,null,null,null,null,null,null,null,null,null,null,null,null,null,null,null,null,null,null,null,null,null,null,null,"N/E",null,null,null,null,null,null,null,null,null,null,null,null,null,null,null,null,null,null,null,null,null,null,null,null,null,null,null,null,null,null,null,"N/E",null,null,null,null,null,null,null,null,null,null,null,null,null,null,null,null,null,null,null,null,null,null,null,null,null,null,null,null,null,null,null,"N/E",null,null,null,null,null,null,null,null,null,null,null,null,null,null,null,null,null,null,null,null,null,null,null,null,null,null,null,null,null,null,null,"N/E",null,null,null,null,null,null,null,null,null,null,null,null,null,null,null,null,null,null,null,null,null,null,null,null,null,null,null,null,null,null,null,"N/E"]
[null,null,null,{"$f":"IF($B$1>2,TRUE,FALSE)","v":true},null,null,null,null,null,null,null,null,"O8 -Valider des solutions techniques"]
[null,0,{"$f":"IF(OR(CE30=\"OK\",EQ30=\"OK\"),N30,0)","v":0},{"$f":"IF($B$1=3,TRUE,FALSE)","v":false},null,null,0,0,0,0,null,null,"CO8.ac1. Simuler un comportement structurel, thermique et acoustique de tout ou partie d’une construction",4,null,null,null,null,null,null,null,null,null,null,null,null,null,null,null,null,null,null,null,null,null,null,null,null,null,null,null,null,null,null,null,null,null,null,null,null,{"$f":"IF(AND(AY$1<>\"\",COUNTA(U30:AX30)>0),\"OK\",\"N/E\")","v":"N/E"},null,null,null,null,null,null,null,null,null,null,null,null,null,null,null,null,null,null,null,null,null,null,null,null,null,null,null,null,null,null,null,{"$f":"IF(AND(CE$1<>\"\",COUNTA(U30:CD30)>1),\"OK\",\"N/E\")","v":"N/E"},null,null,null,null,null,null,null,null,null,null,null,null,null,null,null,null,null,null,null,null,null,null,null,null,null,null,null,null,null,null,null,{"$f":"IF(AND(DK$1<>\"\",COUNTA(U30:DJ30)>2),\"OK\",\"N/E\")","v":"N/E"},null,null,null,null,null,null,null,null,null,null,null,null,null,null,null,null,null,null,null,null,null,null,null,null,null,null,null,null,null,null,null,{"$f":"IF(AND(EQ$1<>\"\",COUNTA(U30:EP30)>3),\"OK\",\"N/E\")","v":"N/E"},null,null,null,null,null,null,null,null,null,null,null,null,null,null,null,null,null,null,null,null,null,null,null,null,null,null,null,null,null,null,null,{"$f":"IF(AND(FW$1<>\"\",COUNTA(U30:FV30)>4),\"OK\",\"N/E\")","v":"N/E"}]
[null,0,0,{"$f":"IF($B$1=3,TRUE,FALSE)","v":false},null,null,0,0,0,0,null,null,"CO8.ac2. Analyser les résultats issus de simulations ou d’essais de laboratoire",4,null,null,null,null,null,null,null,null,null,null,null,null,null,null,null,null,null,null,null,null,null,null,null,null,null,null,null,null,null,null,null,null,null,null,null,null,"N/E",null,null,null,null,null,null,null,null,null,null,null,null,null,null,null,null,null,null,null,null,null,null,null,null,null,null,null,null,null,null,null,"N/E",null,null,null,null,null,null,null,null,null,null,null,null,null,null,null,null,null,null,null,null,null,null,null,null,null,null,null,null,null,null,null,"N/E",null,null,null,null,null,null,null,null,null,null,null,null,null,null,null,null,null,null,null,null,null,null,null,null,null,null,null,null,null,null,null,"N/E",null,null,null,null,null,null,null,null,null,null,null,null,null,null,null,null,null,null,null,null,null,null,null,null,null,null,null,null,null,null,null,"N/E"]
[null,0,0,{"$f":"IF($B$1=3,TRUE,FALSE)","v":false},null,null,0,0,0,0,null,null,"CO8.ac3. Analyser/valider les choix structurels et de confort",4,null,null,null,null,null,null,null,null,null,null,null,null,null,null,null,null,null,null,null,null,null,null,null,null,null,null,null,null,null,null,null,null,null,null,null,null,"N/E",null,null,null,null,null,null,null,null,null,null,null,null,null,null,null,null,null,null,null,null,null,null,null,null,null,null,null,null,null,null,null,"N/E",null,null,null,null,null,null,null,null,null,null,null,null,null,null,null,null,null,null,null,null,null,null,null,null,null,null,null,null,null,null,null,"N/E",null,null,null,null,null,null,null,null,null,null,null,null,null,null,null,null,null,null,null,null,null,null,null,null,null,null,null,null,null,null,null,"N/E",null,null,null,null,null,null,null,null,null,null,null,null,null,null,null,null,null,null,null,null,null,null,null,null,null,null,null,null,null,null,null,"N/E"]
[null,3,0,{"$f":"IF($B$1=4,TRUE,FALSE)","v":true},null,null,3,0,0,0,null,null,"CO8.ee1. Renseigner un logiciel de simulation du comportement énergétique avec les caractéristiques du système et les paramètres externes pour un point de fonctionnement donné",3,null,null,null,null,null,null,null,null,null,null,null,null,null,null,null,null,null,null,null,null,null,null,null,null,null,null,null,null,null,null,null,null,null,null,null,null,"N/E",null,null,null,null,null,null,null,null,null,null,null,null,null,null,null,null,null,null,null,null,null,null,null,null,null,null,null,null,null,null,null,"N/E",null,null,null,null,null,null,null,null,null,null,null,null,null,null,null,null,null,null,null,null,null,null,null,null,null,null,null,null,null,null,null,"N/E",null,null,null,null,null,null,null,null,null,null,null,null,null,null,null,null,null,null,null,null,null,null,null,null,null,null,null,null,null,null,null,"N/E",null,null,null,null,null,null,null,null,null,null,null,null,null,null,null,null,null,null,null,null,null,null,null,null,null,null,null,null,null,null,null,"N/E"]
[null,4,0,{"$f":"IF($B$1=4,TRUE,FALSE)","v":true},null,null,4,0,0,0,null,null,"CO8.ee2. Interpréter les résultats d'une simulation afin de valider une solution ou l’optimiser",4,null,null,null,null,null,null,null,null,null,null,null,null,null,null,null,null,null,null,null,null,null,null,null,null,null,null,null,null,null,null,null,null,null,null,null,null,"N/E",null,null,null,null,null,null,null,null,null,null,null,null,null,null,null,null,null,null,null,null,null,null,null,null,null,null,null,null,null,null,null,"N/E",null,null,null,null,null,null,null,null,null,null,null,null,null,null,null,null,null,null,null,null,null,null,null,null,null,null,null,null,null,null,null,"N/E",null,null,null,null,null,null,null,null,null,null,null,null,null,null,null,null,null,null,null,null,null,null,null,null,null,null,null,null,null,null,null,"N/E",null,null,null,null,null,null,null,null,null,null,null,null,null,null,null,null,null,null,null,null,null,null,null,null,null,null,null,null,null,null,null,"N/E"]
[null,3,0,{"$f":"IF($B$1=4,TRUE,FALSE)","v":true},null,null,3,0,0,0,null,null,"CO8.ee3. Comparer et interpréter le résultat d'une simulation d'un comportement d’un système avec un comportement réel",3,null,null,null,null,null,null,null,null,null,null,null,null,null,null,null,null,null,null,null,null,null,null,null,null,null,null,null,null,null,null,null,null,null,null,null,null,"N/E",null,null,null,null,null,null,null,null,null,null,null,null,null,null,null,null,null,null,null,null,null,null,null,null,null,null,null,null,null,null,null,"N/E",null,null,null,null,null,null,null,null,null,null,null,null,null,null,null,null,null,null,null,null,null,null,null,null,null,null,null,null,null,null,null,"N/E",null,null,null,null,null,null,null,null,null,null,null,null,null,null,null,null,null,null,null,null,null,null,null,null,null,null,null,null,null,null,null,"N/E",null,null,null,null,null,null,null,null,null,null,null,null,null,null,null,null,null,null,null,null,null,null,null,null,null,null,null,null,null,null,null,"N/E"]
[null,5,0,{"$f":"IF($B$1=4,TRUE,FALSE)","v":true},null,null,5,5,0,0,null,null,"CO8.ee4. Mettre en oeuvre un protocole d’essais et de mesures sur le prototype d’une chaîne d’énergie, interpréter les résultats",5,null,null,null,null,null,null,null,null,null,null,null,null,null,null,null,null,null,null,null,null,null,null,null,null,null,null,null,null,null,null,null,null,null,null,null,null,"N/E",null,null,null,null,null,null,null,null,null,null,null,null,null,null,null,null,null,null,null,null,null,null,null,null,null,null,null,null,null,null,null,"N/E",null,null,null,null,null,null,null,null,null,null,null,null,null,null,null,null,null,null,null,null,null,null,null,null,null,null,null,null,null,null,null,"N/E",null,null,null,null,null,null,null,null,null,null,null,null,null,null,null,null,null,null,null,null,null,null,null,null,null,null,null,null,null,null,null,"N/E",null,null,"x",null,null,null,null,null,null,null,null,null,null,null,null,null,null,null,null,null,null,null,null,null,null,null,null,null,null,null,null,"OK"]
[null,0,0,{"$f":"IF($B$1=5,TRUE,FALSE)","v":false},null,null,0,0,0,0,null,null,"CO8.itec1. Paramétrer un logiciel de simulation mécanique pour obtenir les caractéristiques d'une loi d'entrée/sortie d'un mécanisme simple",3,null,null,null,null,null,null,null,null,null,null,null,null,null,null,null,null,null,null,null,null,null,null,null,null,null,null,null,null,null,null,null,null,null,null,null,null,"N/E",null,null,null,null,null,null,null,null,null,null,null,null,null,null,null,null,null,null,null,null,null,null,null,null,null,null,null,null,null,null,null,"N/E",null,null,null,null,null,null,null,null,null,null,null,null,null,null,null,null,null,null,null,null,null,null,null,null,null,null,null,null,null,null,null,"N/E",null,null,null,null,null,null,null,null,null,null,null,null,null,null,null,null,null,null,null,null,null,null,null,null,null,null,null,null,null,null,null,"N/E",null,null,null,null,null,null,null,null,null,null,null,null,null,null,null,null,null,null,null,null,null,null,null,null,null,null,null,null,null,null,null,"N/E"]
[null,0,0,{"$f":"IF($B$1=5,TRUE,FALSE)","v":false},null,null,0,0,0,0,null,null,"CO8.itec2. Interpréter les résultats d'une simulation mécanique pour valider une solution ou modifier une pièce ou un mécanisme",4,null,null,null,null,null,null,null,null,null,null,null,null,null,null,null,null,null,null,null,null,null,null,null,null,null,null,null,null,null,null,null,null,null,null,null,null,"N/E",null,null,null,null,null,null,null,null,null,null,null,null,null,null,null,null,null,null,null,null,null,null,null,null,null,null,null,null,null,null,null,"N/E",null,null,null,null,null,null,null,null,null,null,null,null,null,null,null,null,null,null,null,null,null,null,null,null,null,null,null,null,null,null,null,"N/E",null,null,null,null,null,null,null,null,null,null,null,null,null,null,null,null,null,null,null,null,null,null,null,null,null,null,null,null,null,null,null,"N/E",null,null,null,null,null,null,null,null,null,null,null,null,null,null,null,null,null,null,null,null,null,null,null,null,null,null,null,null,null,null,null,"N/E"]
[null,0,0,{"$f":"IF($B$1=5,TRUE,FALSE)","v":false},null,null,0,0,0,0,null,null,"CO8.itec3. Mettre en oeuvre un protocole d’essais et de mesures, interpréter les résultats",5,null,null,null,null,null,null,null,null,null,null,null,null,null,null,null,null,null,null,null,null,null,null,null,null,null,null,null,null,null,null,null,null,null,null,null,null,"N/E",null,null,null,null,null,null,null,null,null,null,null,null,null,null,null,null,null,null,null,null,null,null,null,null,null,null,null,null,null,null,null,"N/E",null,null,null,null,null,null,null,null,null,null,null,null,null,null,null,null,null,null,null,null,null,null,null,null,null,null,null,null,null,null,null,"N/E",null,null,null,null,null,null,null,null,null,null,null,null,null,null,null,null,null,null,null,null,null,null,null,null,null,null,null,null,null,null,null,"N/E",null,null,null,null,null,null,null,null,null,null,null,null,null,null,null,null,null,null,null,null,null,null,null,null,null,null,null,null,null,null,null,"N/E"]
[null,0,0,{"$f":"IF($B$1=5,TRUE,FALSE)","v":false},null,null,0,0,0,0,null,null,"CO8.itec4. Comparer et interpréter le résultat d'une simulation d'un comportement mécanique avec un comportement réel",3,null,null,null,null,null,null,null,null,null,null,null,null,null,null,null,null,null,null,null,null,null,null,null,null,null,null,null,null,null,null,null,null,null,null,null,null,"N/E",null,null,null,null,null,null,null,null,null,null,null,null,null,null,null,null,null,null,null,null,null,null,null,null,null,null,null,null,null,null,null,"N/E",null,null,null,null,null,null,null,null,null,null,null,null,null,null,null,null,null,null,null,null,null,null,null,null,null,null,null,null,null,null,null,"N/E",null,null,null,null,null,null,null,null,null,null,null,null,null,null,null,null,null,null,null,null,null,null,null,null,null,null,null,null,null,null,null,"N/E",null,null,null,null,null,null,null,null,null,null,null,null,null,null,null,null,null,null,null,null,null,null,null,null,null,null,null,null,null,null,null,"N/E"]
[null,0,0,{"$f":"IF($B$1=6,TRUE,FALSE)","v":false},null,null,0,0,0,0,null,null,"CO8.sin1. Rechercher et choisir une solution logicielle ou matérielle au regard de la définition d'un système",3,null,null,null,null,null,null,null,null,null,null,null,null,null,null,null,null,null,null,null,null,null,null,null,null,null,null,null,null,null,null,null,null,null,null,null,null,"N/E",null,null,null,null,null,null,null,null,null,null,null,null,null,null,null,null,null,null,null,null,null,null,null,null,null,null,null,null,null,null,null,"N/E",null,null,null,null,null,null,null,null,null,null,null,null,null,null,null,null,null,null,null,null,null,null,null,null,null,null,null,null,null,null,null,"N/E",null,null,null,null,null,null,null,null,null,null,null,null,null,null,null,null,null,null,null,null,null,null,null,null,null,null,null,null,null,null,null,"N/E",null,null,null,null,null,null,null,null,null,null,null,null,null,null,null,null,null,null,null,null,null,null,null,null,null,null,null,null,null,null,null,"N/E"]
[null,0,0,{"$f":"IF($B$1=6,TRUE,FALSE)","v":false},null,null,0,0,0,0,null,null,"CO8.sin2. Établir pour une fonction précédemment identifiée un modèle de comportement à partir de mesures faites sur le système",4,null,null,null,null,null,null,null,null,null,null,null,null,null,null,null,null,null,null,null,null,null,null,null,null,null,null,null,null,null,null,null,null,null,null,null,null,"N/E",null,null,null,null,null,null,null,null,null,null,null,null,null,null,null,null,null,null,null,null,null,null,null,null,null,null,null,null,null,null,null,"N/E",null,null,null,null,null,null,null,null,null,null,null,null,null,null,null,null,null,null,null,null,null,null,null,null,null,null,null,null,null,null,null,"N/E",null,null,null,null,null,null,null,null,null,null,null,null,null,null,null,null,null,null,null,null,null,null,null,null,null,null,null,null,null,null,null,"N/E",null,null,null,null,null,null,null,null,null,null,null,null,null,null,null,null,null,null,null,null,null,null,null,null,null,null,null,null,null,null,null,"N/E"]
[null,0,0,{"$f":"IF($B$1=6,TRUE,FALSE)","v":false},null,null,0,0,0,0,null,null,"CO8.sin3. Traduire sous forme graphique l’architecture de la chaîne d’information identifiée pour un système et définir les paramètres d’utilisation du simulateur",3,null,null,null,null,null,null,null,null,null,null,null,null,null,null,null,null,null,null,null,null,null,null,null,null,null,null,null,null,null,null,null,null,null,null,null,null,"N/E",null,null,null,null,null,null,null,null,null,null,null,null,null,null,null,null,null,null,null,null,null,null,null,null,null,null,null,null,null,null,null,"N/E",null,null,null,null,null,null,null,null,null,null,null,null,null,null,null,null,null,null,null,null,null,null,null,null,null,null,null,null,null,null,null,"N/E",null,null,null,null,null,null,null,null,null,null,null,null,null,null,null,null,null,null,null,null,null,null,null,null,null,null,null,null,null,null,null,"N/E",null,null,null,null,null,null,null,null,null,null,null,null,null,null,null,null,null,null,null,null,null,null,null,null,null,null,null,null,null,null,null,"N/E"]
[null,0,0,{"$f":"IF($B$1=6,TRUE,FALSE)","v":false},null,null,0,0,0,0,null,null,"CO8.sin4. Identifier les variables simulées et mesurées sur un système pour valider le choix d’une solution",4,null,null,null,null,null,null,null,null,null,null,null,null,null,null,null,null,null,null,null,null,null,null,null,null,null,null,null,null,null,null,null,null,null,null,null,null,"N/E",null,null,null,null,null,null,null,null,null,null,null,null,null,null,null,null,null,null,null,null,null,null,null,null,null,null,null,null,null,null,null,"N/E",null,null,null,null,null,null,null,null,null,null,null,null,null,null,null,null,null,null,null,null,null,null,null,null,null,null,null,null,null,null,null,"N/E",null,null,null,null,null,null,null,null,null,null,null,null,null,null,null,null,null,null,null,null,null,null,null,null,null,null,null,null,null,null,null,"N/E",null,null,null,null,null,null,null,null,null,null,null,null,null,null,null,null,null,null,null,null,null,null,null,null,null,null,null,null,null,null,null,"N/E"]
[null,5,{"$f":"IF(FX45=\"OK\",N45,0)","v":0},{"$f":"IF($B$1>2,TRUE,FALSE)","v":true},null,null,0,0,5,0,null,null,"CO8.es Justifier des éléments d'une simulation relative au comportement de tout ou partie d'un système et les écarts par rapport au réel",5,null,null,null,null,null,null,null,null,null,null,null,null,null,null,null,null,null,null,null,null,null,null,null,null,null,null,null,null,null,null,null,null,null,null,null,null,">",null,null,null,null,null,null,null,null,null,null,null,null,null,null,null,null,null,null,null,null,null,null,null,null,null,null,null,null,null,null,null,">",null,null,null,null,null,null,null,null,null,null,null,null,null,null,null,null,null,null,null,null,null,null,null,null,null,null,null,null,null,null,null,">",null,null,null,null,null,null,null,null,null,null,null,null,null,null,null,null,null,null,null,null,null,null,null,null,null,null,null,null,null,null,null,">",null,null,null,null,null,null,null,null,null,null,null,null,null,null,null,null,null,null,null,null,null,null,null,null,null,null,null,null,null,null,null,">",{"$f":"IF(COUNTA(U45:FW45)>5,\"OK\",\"N/E\")","v":"N/E"}]
[null,null,null,{"$f":"IF($B$1>2,TRUE,FALSE)","v":true},null,null,null,null,null,null,null,null,"O9 – Gérer la vie du produit"]
[null,0,{"$f":"IF(OR(CE47=\"OK\",EQ47=\"OK\"),N47,0)","v":0},{"$f":"IF($B$1=3,TRUE,FALSE)","v":false},null,null,0,0,0,0,null,null,"CO9.ac1. Améliorer les performances d’une construction du point de vue énergétique, domotique et informationnel",5,null,null,null,null,null,null,null,null,null,null,null,null,null,null,null,null,null,null,null,null,null,null,null,null,null,null,null,null,null,null,null,null,null,null,null,null,{"$f":"IF(AND(AY$1<>\"\",COUNTA(U47:AX47)>0),\"OK\",\"N/E\")","v":"N/E"},null,null,null,null,null,null,null,null,null,null,null,null,null,null,null,null,null,null,null,null,null,null,null,null,null,null,null,null,null,null,null,{"$f":"IF(AND(CE$1<>\"\",COUNTA(U47:CD47)>1),\"OK\",\"N/E\")","v":"N/E"},null,null,null,null,null,null,null,null,null,null,null,null,null,null,null,null,null,null,null,null,null,null,null,null,null,null,null,null,null,null,null,{"$f":"IF(AND(DK$1<>\"\",COUNTA(U47:DJ47)>2),\"OK\",\"N/E\")","v":"N/E"},null,null,null,null,null,null,null,null,null,null,null,null,null,null,null,null,null,null,null,null,null,null,null,null,null,null,null,null,null,null,null,{"$f":"IF(AND(EQ$1<>\"\",COUNTA(U47:EP47)>3),\"OK\",\"N/E\")","v":"N/E"},null,null,null,null,null,null,null,null,null,null,null,null,null,null,null,null,null,null,null,null,null,null,null,null,null,null,null,null,null,null,null,{"$f":"IF(AND(FW$1<>\"\",COUNTA(U47:FV47)>4),\"OK\",\"N/E\")","v":"N/E"}]
[null,0,0,{"$f":"IF($B$1=3,TRUE,FALSE)","v":false},null,null,0,0,0,0,null,null,"CO9.ac2. Identifier et décrire les causes de désordre dans une construction",3,null,null,null,null,null,null,null,null,null,null,null,null,null,null,null,null,null,null,null,null,null,null,null,null,null,null,null,null,null,null,null,null,null,null,null,null,"N/E",null,null,null,null,null,null,null,null,null,null,null,null,null,null,null,null,null,null,null,null,null,null,null,null,null,null,null,null,null,null,null,"N/E",null,null,null,null,null,null,null,null,null,null,null,null,null,null,null,null,null,null,null,null,null,null,null,null,null,null,null,null,null,null,null,"N/E",null,null,null,null,null,null,null,null,null,null,null,null,null,null,null,null,null,null,null,null,null,null,null,null,null,null,null,null,null,null,null,"N/E",null,null,null,null,null,null,null,null,null,null,null,null,null,null,null,null,null,null,null,null,null,null,null,null,null,null,null,null,null,null,null,"N/E"]
[null,0,0,{"$f":"IF($B$1=3,TRUE,FALSE)","v":false},null,null,0,0,0,0,null,null,"CO9.ac3. Valoriser la fin de vie du produit : déconstruction, gestion des déchets, valorisation des produits",3,null,null,null,null,null,null,null,null,null,null,null,null,null,null,null,null,null,null,null,null,null,null,null,null,null,null,null,null,null,null,null,null,null,null,null,null,"N/E",null,null,null,null,null,null,null,null,null,null,null,null,null,null,null,null,null,null,null,null,null,null,null,null,null,null,null,null,null,null,null,"N/E",null,null,null,null,null,null,null,null,null,null,null,null,null,null,null,null,null,null,null,null,null,null,null,null,null,null,null,null,null,null,null,"N/E",null,null,null,null,null,null,null,null,null,null,null,null,null,null,null,null,null,null,null,null,null,null,null,null,null,null,null,null,null,null,null,"N/E",null,null,null,null,null,null,null,null,null,null,null,null,null,null,null,null,null,null,null,null,null,null,null,null,null,null,null,null,null,null,null,"N/E"]
[null,3,0,{"$f":"IF($B$1=4,TRUE,FALSE)","v":true},null,null,3,3,0,0,null,null,"CO9.ee1. Expérimenter des procédés de stockage, de production, de transport, de transformation, d’énergie pour aider à la conception d’une chaîne d’énergie",3,null,null,null,null,null,null,null,null,null,null,null,null,null,null,null,null,null,null,null,null,null,null,null,null,null,null,null,null,null,null,null,null,null,null,null,null,"N/E",null,null,null,null,null,null,null,null,null,null,null,null,null,null,null,null,null,null,null,null,null,null,null,null,null,null,null,null,null,null,null,"N/E",null,null,null,null,null,null,null,null,null,null,null,null,null,null,null,null,null,null,null,null,null,null,null,null,null,null,null,null,null,null,null,"N/E",null,null,null,null,null,null,null,null,null,null,null,null,null,null,null,null,null,null,null,null,null,null,null,null,null,null,null,null,null,null,null,"N/E",null,null,"x",null,null,null,null,null,null,null,null,null,null,null,null,null,null,null,null,null,null,null,null,null,null,null,null,null,null,null,null,"OK"]
[null,4,4,{"$f":"IF($B$1=4,TRUE,FALSE)","v":true},null,null,4,4,0,0,null,null,"CO9.ee2. Réaliser et valider un prototype obtenu en réponse à tout ou partie du cahier des charges initial",4,null,null,null,null,null,null,null,null,null,null,null,null,null,null,null,null,null,null,null,null,null,null,null,null,null,null,null,null,null,null,null,null,null,null,null,null,"N/E",null,null,null,null,null,null,null,null,null,null,null,null,null,null,null,null,null,null,null,null,null,null,null,null,null,null,null,null,null,null,null,"N/E",null,null,null,null,null,null,null,null,null,null,null,null,null,null,null,null,null,null,null,null,null,null,null,null,null,null,null,null,null,null,null,"N/E",null,null,"x",null,null,null,null,"x",null,null,null,null,null,null,null,null,null,null,null,null,null,null,null,null,null,null,null,null,null,null,null,"OK",null,null,null,null,null,null,null,"x",null,null,null,null,null,null,null,null,null,null,null,null,null,null,null,null,null,null,null,null,null,null,null,"OK"]
[null,4,0,{"$f":"IF($B$1=4,TRUE,FALSE)","v":true},null,null,4,4,0,0,null,null,"CO9.ee3. Intégrer un prototype dans un système à modifier pour valider son comportement et ses performances",4,null,null,null,null,null,null,null,null,null,null,null,null,null,null,null,null,null,null,null,null,null,null,null,null,null,null,null,null,null,null,null,null,null,null,null,null,"N/E",null,null,null,null,null,null,null,null,null,null,null,null,null,null,null,null,null,null,null,null,null,null,null,null,null,null,null,null,null,null,null,"N/E",null,null,null,null,null,null,null,null,null,null,null,null,null,null,null,null,null,null,null,null,null,null,null,null,null,null,null,null,null,null,null,"N/E",null,null,null,null,null,null,null,null,null,null,null,null,null,null,null,null,null,null,null,null,null,null,null,null,null,null,null,null,null,null,null,"N/E",null,null,"x",null,null,null,null,null,null,null,null,null,null,null,null,null,null,null,null,null,null,null,null,null,null,null,null,null,null,null,null,"OK"]
[null,0,0,{"$f":"IF($B$1=5,TRUE,FALSE)","v":false},null,null,0,0,0,0,null,null,"CO9.itec1. Expérimenter des procédés pour caractériser les paramètres de transformation de la matière et leurs conséquences sur la définition et l’obtention de pièces",3,null,null,null,null,null,null,null,null,null,null,null,null,null,null,null,null,null,null,null,null,null,null,null,null,null,null,null,null,null,null,null,null,null,null,null,null,"N/E",null,null,null,null,null,null,null,null,null,null,null,null,null,null,null,null,null,null,null,null,null,null,null,null,null,null,null,null,null,null,null,"N/E",null,null,null,null,null,null,null,null,null,null,null,null,null,null,null,null,null,null,null,null,null,null,null,null,null,null,null,null,null,null,null,"N/E",null,null,null,null,null,null,null,null,null,null,null,null,null,null,null,null,null,null,null,null,null,null,null,null,null,null,null,null,null,null,null,"N/E",null,null,null,null,null,null,null,null,null,null,null,null,null,null,null,null,null,null,null,null,null,null,null,null,null,null,null,null,null,null,null,"N/E"]
[null,0,0,{"$f":"IF($B$1=5,TRUE,FALSE)","v":false},null,null,0,0,0,0,null,null,"CO9.itec2. Réaliser et valider un prototype obtenu par rapport à tout ou partie du cahier des charges initial",4,null,null,null,null,null,null,null,null,null,null,null,null,null,null,null,null,null,null,null,null,null,null,null,null,null,null,null,null,null,null,null,null,null,null,null,null,"N/E",null,null,null,null,null,null,null,null,null,null,null,null,null,null,null,null,null,null,null,null,null,null,null,null,null,null,null,null,null,null,null,"N/E",null,null,null,null,null,null,null,null,null,null,null,null,null,null,null,null,null,null,null,null,null,null,null,null,null,null,null,null,null,null,null,"N/E",null,null,null,null,null,null,null,null,null,null,null,null,null,null,null,null,null,null,null,null,null,null,null,null,null,null,null,null,null,null,null,"N/E",null,null,null,null,null,null,null,null,null,null,null,null,null,null,null,null,null,null,null,null,null,null,null,null,null,null,null,null,null,null,null,"N/E"]
[null,0,0,{"$f":"IF($B$1=5,TRUE,FALSE)","v":false},null,null,0,0,0,0,null,null,"CO9.itec3. Intégrer les pièces prototypes dans le système à modifier pour valider son comportement et ses performances",4,null,null,null,null,null,null,null,null,null,null,null,null,null,null,null,null,null,null,null,null,null,null,null,null,null,null,null,null,null,null,null,null,null,null,null,null,"N/E",null,null,null,null,null,null,null,null,null,null,null,null,null,null,null,null,null,null,null,null,null,null,null,null,null,null,null,null,null,null,null,"N/E",null,null,null,null,null,null,null,null,null,null,null,null,null,null,null,null,null,null,null,null,null,null,null,null,null,null,null,null,null,null,null,"N/E",null,null,null,null,null,null,null,null,null,null,null,null,null,null,null,null,null,null,null,null,null,null,null,null,null,null,null,null,null,null,null,"N/E",null,null,null,null,null,null,null,null,null,null,null,null,null,null,null,null,null,null,null,null,null,null,null,null,null,null,null,null,null,null,null,"N/E"]
[null,0,0,{"$f":"IF($B$1=6,TRUE,FALSE)","v":false},null,null,0,0,0,0,null,null,"CO9.sin1. Utiliser les outils adaptés pour planifier un projet (diagramme de Gantt, chemin critique, données économiques, réunions de projet)",3,null,null,null,null,null,null,null,null,null,null,null,null,null,null,null,null,null,null,null,null,null,null,null,null,null,null,null,null,null,null,null,null,null,null,null,null,"N/E",null,null,null,null,null,null,null,null,null,null,null,null,null,null,null,null,null,null,null,null,null,null,null,null,null,null,null,null,null,null,null,"N/E",null,null,null,null,null,null,null,null,null,null,null,null,null,null,null,null,null,null,null,null,null,null,null,null,null,null,null,null,null,null,null,"N/E",null,null,null,null,null,null,null,null,null,null,null,null,null,null,null,null,null,null,null,null,null,null,null,null,null,null,null,null,null,null,null,"N/E",null,null,null,null,null,null,null,null,null,null,null,null,null,null,null,null,null,null,null,null,null,null,null,null,null,null,null,null,null,null,null,"N/E"]
[null,0,0,{"$f":"IF($B$1=6,TRUE,FALSE)","v":false},null,null,0,0,0,0,null,null,"CO9.sin2. Installer, configurer et instrumenter un système réel Mettre en oeuvre la chaîne d’acquisition puis acquérir, traiter, transmettre et restituer l’information",5,null,null,null,null,null,null,null,null,null,null,null,null,null,null,null,null,null,null,null,null,null,null,null,null,null,null,null,null,null,null,null,null,null,null,null,null,"N/E",null,null,null,null,null,null,null,null,null,null,null,null,null,null,null,null,null,null,null,null,null,null,null,null,null,null,null,null,null,null,null,"N/E",null,null,null,null,null,null,null,null,null,null,null,null,null,null,null,null,null,null,null,null,null,null,null,null,null,null,null,null,null,null,null,"N/E",null,null,null,null,null,null,null,null,null,null,null,null,null,null,null,null,null,null,null,null,null,null,null,null,null,null,null,null,null,null,null,"N/E",null,null,null,null,null,null,null,null,null,null,null,null,null,null,null,null,null,null,null,null,null,null,null,null,null,null,null,null,null,null,null,"N/E"]
[null,0,0,{"$f":"IF($B$1=6,TRUE,FALSE)","v":false},null,null,0,0,0,0,null,null,"CO9.sin3. Rechercher des évolutions de constituants dans le cadre d’une démarche de veille technologique, analyser la structure d'un système pour intervenir sur les constituants dans le cadre d'une opération de maintenance",4,null,null,null,null,null,null,null,null,null,null,null,null,null,null,null,null,null,null,null,null,null,null,null,null,null,null,null,null,null,null,null,null,null,null,null,null,"N/E",null,null,null,null,null,null,null,null,null,null,null,null,null,null,null,null,null,null,null,null,null,null,null,null,null,null,null,null,null,null,null,"N/E",null,null,null,null,null,null,null,null,null,null,null,null,null,null,null,null,null,null,null,null,null,null,null,null,null,null,null,null,null,null,null,"N/E",null,null,null,null,null,null,null,null,null,null,null,null,null,null,null,null,null,null,null,null,null,null,null,null,null,null,null,null,null,null,null,"N/E",null,null,null,null,null,null,null,null,null,null,null,null,null,null,null,null,null,null,null,null,null,null,null,null,null,null,null,null,null,null,null,"N/E"]
[null,0,0,{"$f":"IF($B$1=6,TRUE,FALSE)","v":false},null,null,0,0,0,0,null,null,"CO9.sin4. Rechercher et choisir de nouveaux constituants d’un système (ou d’un projet finalisé) au regard d’évolutions technologiques, socio-économiques spécifiées dans un cahier des charges. Organiser le projet permettant de « maquettiser » la solution choisie",5,null,null,null,null,null,null,null,null,null,null,null,null,null,null,null,null,null,null,null,null,null,null,null,null,null,null,null,null,null,null,null,null,null,null,null,null,"N/E",null,null,null,null,null,null,null,null,null,null,null,null,null,null,null,null,null,null,null,null,null,null,null,null,null,null,null,null,null,null,null,"N/E",null,null,null,null,null,null,null,null,null,null,null,null,null,null,null,null,null,null,null,null,null,null,null,null,null,null,null,null,null,null,null,"N/E",null,null,null,null,null,null,null,null,null,null,null,null,null,null,null,null,null,null,null,null,null,null,null,null,null,null,null,null,null,null,null,"N/E",null,null,null,null,null,null,null,null,null,null,null,null,null,null,null,null,null,null,null,null,null,null,null,null,null,null,null,null,null,null,null,"N/E"]
[null,null,null,{"$f":"IF($B$1=2,TRUE,FALSE)","v":false},null,null,null,null,null,null,null,"B","-  Modéliser",0.4]
[null,null,null,false,null,null,null,null,null,null,null,null,"B3 - Résoudre et simuler : Simuler le fonctionnement de tout ou partie d’un système à l’aide d’un modèle fourni"]
[null,{"$f":"N62*D62*$N$60","v":0},{"$f":"IF(COUNTA(T62:CD62)<>0,N62,0)","v":0.2},false,null,null,0,0,0,0,null,null,"Les paramètres influents sont identifiés",0.2,null,null,null,null,null,null,null,null,null,null,null,null,null,null,null,null,null,null,null,null,null,null,null,null,null,null,null,null,null,null,null,null,null,null,null,null,{"$f":"IF(AND(AY$1<>\"\",COUNTA(U62:AX62)>0),\"OK\",\"N/E\")","v":"N/E"},null,null,null,null,null,null,null,null,null,null,null,null,null,null,null,null,null,null,null,null,null,null,null,null,null,null,null,null,null,null,null,{"$f":"IF(AND(CE$1<>\"\",COUNTA(U62:CD62)>1),\"OK\",\"N/E\")","v":"N/E"},null,null,null,null,null,null,null,null,null,null,null,null,null,null,null,null,null,null,null,null,null,null,null,null,null,null,null,null,null,null,null,{"$f":"IF(AND(DK$1<>\"\",COUNTA(U62:DJ62)>2),\"OK\",\"N/E\")","v":"N/E"},null,null,null,null,null,null,null,null,null,null,null,null,null,null,null,null,null,null,null,null,null,null,null,null,null,null,null,null,null,null,null,{"$f":"IF(AND(EQ$1<>\"\",COUNTA(U62:EP62)>3),\"OK\",\"N/E\")","v":"N/E"},null,null,null,null,null,null,null,null,null,null,null,null,null,null,null,null,null,null,null,null,null,null,null,null,null,null,null,null,null,null,null,{"$f":"IF(AND(FW$1<>\"\",COUNTA(U62:FV62)>4),\"OK\",\"N/E\")","v":"N/E"}]
[null,{"$f":"N63*D63*$N$60","v":0},0.2,false,null,null,0,0,0,0,null,null,"Les limites de simulation sont correctement définies",0.2,null,null,null,null,null,null,null,null,null,null,null,null,null,null,null,null,null,null,null,null,null,null,null,null,null,null,null,null,null,null,null,null,null,null,null,null,{"$f":"IF(AND(AY$1<>\"\",COUNTA(U63:AX63)>0),\"OK\",\"N/E\")","v":"N/E"},null,null,null,null,null,null,null,null,null,null,null,null,null,null,null,null,null,null,null,null,null,null,null,null,null,null,null,null,null,null,null,{"$f":"IF(AND(CE$1<>\"\",COUNTA(U63:CD63)>1),\"OK\",\"N/E\")","v":"N/E"},null,null,null,null,null,null,null,null,null,null,null,null,null,null,null,null,null,null,null,null,null,null,null,null,null,null,null,null,null,null,null,{"$f":"IF(AND(DK$1<>\"\",COUNTA(U63:DJ63)>2),\"OK\",\"N/E\")","v":"N/E"},null,null,null,null,null,null,null,null,null,null,null,null,null,null,null,null,null,null,null,null,null,null,null,null,null,null,null,null,null,null,null,{"$f":"IF(AND(EQ$1<>\"\",COUNTA(U63:EP63)>3),\"OK\",\"N/E\")","v":"N/E"},null,null,null,null,null,null,null,null,null,null,null,null,null,null,null,null,null,null,null,null,null,null,null,null,null,null,null,null,null,null,null,{"$f":"IF(AND(FW$1<>\"\",COUNTA(U63:FV63)>4),\"OK\",\"N/E\")","v":"N/E"}]
[null,null,null,false,null,null,null,null,null,null,null,null,"B4 - Valider un modèle : Valider un modèle fourni, interpréter les résultats obtenus, préciser les limites de validité du modèle utilisé et modifier les paramètres du modèle pour répondre au cahier des charges ou aux résultats expérimentaux"]
[null,{"$f":"N65*D65*$N$60","v":0},0.15,false,null,null,0,0,0,0,null,null,"Les résultats sont correctement interprétés",0.15,null,null,null,null,null,null,null,null,null,null,null,null,null,null,null,null,null,null,null,null,null,null,null,null,null,null,null,null,null,null,null,null,null,null,null,null,">",null,null,null,null,null,null,null,null,null,null,null,null,null,null,null,null,null,null,null,null,null,null,null,null,null,null,null,null,null,null,null,">",null,null,null,null,null,null,null,null,null,null,null,null,null,null,null,null,null,null,null,null,null,null,null,null,null,null,null,null,null,null,null,">",null,null,null,null,null,null,null,null,null,null,null,null,null,null,null,null,null,null,null,null,null,null,null,null,null,null,null,null,null,null,null,">",null,null,null,null,null,null,null,null,null,null,null,null,null,null,null,null,null,null,null,null,null,null,null,null,null,null,null,null,null,null,null,">",{"$f":"IF(COUNTA(U65:FW65)>5,\"OK\",\"N/E\")","v":"N/E"}]
[null,{"$f":"N66*D66*$N$60","v":0},0.15,false,null,null,0,0,0,0,null,null,"Ces limites sont explicitées",0.15,null,null,null,null,null,null,null,null,null,null,null,null,null,null,null,null,null,null,null,null,null,null,null,null,null,null,null,null,null,null,null,null,null,null,null,null,">",null,null,null,null,null,null,null,null,null,null,null,null,null,null,null,null,null,null,null,null,null,null,null,null,null,null,null,null,null,null,null,">",null,null,null,null,null,null,null,null,null,null,null,null,null,null,null,null,null,null,null,null,null,null,null,null,null,null,null,null,null,null,null,">",null,null,null,null,null,null,null,null,null,null,null,null,null,null,null,null,null,null,null,null,null,null,null,null,null,null,null,null,null,null,null,">",null,null,null,null,null,null,null,null,null,null,null,null,null,null,null,null,null,null,null,null,null,null,null,null,null,null,null,null,null,null,null,">",{"$f":"IF(COUNTA(U66:FW66)>5,\"OK\",\"N/E\")","v":"N/E"}]
[null,{"$f":"N67*D67*$N$60","v":0},0.15,false,null,null,0,0,0,0,null,null,"Les paramètres modifiés sont pertinents",0.15,null,null,null,null,null,null,null,null,null,null,null,null,null,null,null,null,null,null,null,null,null,null,null,null,null,null,null,null,null,null,null,null,null,null,null,null,">",null,null,null,null,null,null,null,null,null,null,null,null,null,null,null,null,null,null,null,null,null,null,null,null,null,null,null,null,null,null,null,">",null,null,null,null,null,null,null,null,null,null,null,null,null,null,null,null,null,null,null,null,null,null,null,null,null,null,null,null,null,null,null,">",null,null,null,null,null,null,null,null,null,null,null,null,null,null,null,null,null,null,null,null,null,null,null,null,null,null,null,null,null,null,null,">",null,null,null,null,null,null,null,null,null,null,null,null,null,null,null,null,null,null,null,null,null,null,null,null,null,null,null,null,null,null,null,">",{"$f":"IF(COUNTA(U67:FW67)>5,\"OK\",\"N/E\")","v":"N/E"}]
[null,{"$f":"N68*D68*$N$60","v":0},0.15,false,null,null,0,0,0,0,null,null,"Le modèle modifié répond aux attentes ",0.15,null,null,null,null,null,null,null,null,null,null,null,null,null,null,null,null,null,null,null,null,null,null,null,null,null,null,null,null,null,null,null,null,null,null,null,null,">",null,null,null,null,null,null,null,null,null,null,null,null,null,null,null,null,null,null,null,null,null,null,null,null,null,null,null,null,null,null,null,">",null,null,null,null,null,null,null,null,null,null,null,null,null,null,null,null,null,null,null,null,null,null,null,null,null,null,null,null,null,null,null,">",null,null,null,null,null,null,null,null,null,null,null,null,null,null,null,null,null,null,null,null,null,null,null,null,null,null,null,null,null,null,null,">",null,null,null,null,null,null,null,null,null,null,null,null,null,null,null,null,null,null,null,null,null,null,null,null,null,null,null,null,null,null,null,">",{"$f":"IF(COUNTA(U68:FW68)>5,\"OK\",\"N/E\")","v":"N/E"}]
[null,null,null,false,null,null,null,null,null,null,null,"C","-  Expérimenter",0.4]
[null,null,null,false,null,null,null,null,null,null,null,null," C1 - Justifier le choix d’un protocole expérimental : Identifier les grandeurs physiques à mesurer, décrire une chaîne d'acquisition, identifier le comportement des composants et justifier le choix des essais réalisés"]
[null,{"$f":"N71*D71*$N$69","v":0},{"$f":"IF(COUNTA(T71:CD71)<>0,N71,0)","v":0.08},false,null,null,{"$f":"IF($FX71=\"\",$B71,0)","v":0},{"$f":"IF(OR($AY71=\"OK\",$CE71=\"OK\",$DK71=\"OK\",$EQ71=\"OK\",$FW71=\"OK\"),$B71,0)","v":0},{"$f":"IF($FX71=\"\",0,$B71)","v":0},{"$f":"IF($FX71=\"OK\",$B71,0)","v":0},null,null,"Les grandeurs spécifiques (d'entrée, sortie, matière d'œuvre…) sont correctement identifiées",0.08,null,null,null,null,null,null,null,null,null,null,null,null,null,null,null,null,null,null,null,null,null,null,null,null,null,null,null,null,null,null,null,null,null,null,null,null,{"$f":"IF(AND(AY$1<>\"\",COUNTA(U71:AX71)>0),\"OK\",\"N/E\")","v":"N/E"},null,null,null,null,null,null,null,null,null,null,null,null,null,null,null,null,null,null,null,null,null,null,null,null,null,null,null,null,null,null,null,{"$f":"IF(AND(CE$1<>\"\",COUNTA(U71:CD71)>1),\"OK\",\"N/E\")","v":"N/E"},null,null,null,null,null,null,null,null,null,null,null,null,null,null,null,null,null,null,null,null,null,null,null,null,null,null,null,null,null,null,null,{"$f":"IF(AND(DK$1<>\"\",COUNTA(U71:DJ71)>2),\"OK\",\"N/E\")","v":"N/E"},null,null,null,null,null,null,null,null,null,null,null,null,null,null,null,null,null,null,null,null,null,null,null,null,null,null,null,null,null,null,null,{"$f":"IF(AND(EQ$1<>\"\",COUNTA(U71:EP71)>3),\"OK\",\"N/E\")","v":"N/E"},null,null,null,null,null,null,null,null,null,null,null,null,null,null,null,null,null,null,null,null,null,null,null,null,null,null,null,null,null,null,null,{"$f":"IF(AND(FW$1<>\"\",COUNTA(U71:FV71)>4),\"OK\",\"N/E\")","v":"N/E"}]
[null,{"$f":"N72*D72*$N$69","v":0},0.08,false,null,null,0,0,0,0,null,null,"Les éléments de la chaîne sont correctement identifiés ",0.08,null,null,null,null,null,null,null,null,null,null,null,null,null,null,null,null,null,null,null,null,null,null,null,null,null,null,null,null,null,null,null,null,null,null,null,null,{"$f":"IF(AND(AY$1<>\"\",COUNTA(U72:AX72)>0),\"OK\",\"N/E\")","v":"N/E"},null,null,null,null,null,null,null,null,null,null,null,null,null,null,null,null,null,null,null,null,null,null,null,null,null,null,null,null,null,null,null,{"$f":"IF(AND(CE$1<>\"\",COUNTA(U72:CD72)>1),\"OK\",\"N/E\")","v":"N/E"},null,null,null,null,null,null,null,null,null,null,null,null,null,null,null,null,null,null,null,null,null,null,null,null,null,null,null,null,null,null,null,{"$f":"IF(AND(DK$1<>\"\",COUNTA(U72:DJ72)>2),\"OK\",\"N/E\")","v":"N/E"},null,null,null,null,null,null,null,null,null,null,null,null,null,null,null,null,null,null,null,null,null,null,null,null,null,null,null,null,null,null,null,{"$f":"IF(AND(EQ$1<>\"\",COUNTA(U72:EP72)>3),\"OK\",\"N/E\")","v":"N/E"},null,null,null,null,null,null,null,null,null,null,null,null,null,null,null,null,null,null,null,null,null,null,null,null,null,null,null,null,null,null,null,{"$f":"IF(AND(FW$1<>\"\",COUNTA(U72:FV72)>4),\"OK\",\"N/E\")","v":"N/E"}]
[null,{"$f":"N73*D73*$N$69","v":0},7.0000000000000007E-2,false,null,null,0,0,0,0,null,null,"Les choix et réglages des capteurs et appareils de mesure sont correctement explicités",7.0000000000000007E-2,null,null,null,null,null,null,null,null,null,null,null,null,null,null,null,null,null,null,null,null,null,null,null,null,null,null,null,null,null,null,null,null,null,null,null,null,{"$f":"IF(AND(AY$1<>\"\",COUNTA(U73:AX73)>0),\"OK\",\"N/E\")","v":"N/E"},null,null,null,null,null,null,null,null,null,null,null,null,null,null,null,null,null,null,null,null,null,null,null,null,null,null,null,null,null,null,null,{"$f":"IF(AND(CE$1<>\"\",COUNTA(U73:CD73)>1),\"OK\",\"N/E\")","v":"N/E"},null,null,null,null,null,null,null,null,null,null,null,null,null,null,null,null,null,null,null,null,null,null,null,null,null,null,null,null,null,null,null,{"$f":"IF(AND(DK$1<>\"\",COUNTA(U73:DJ73)>2),\"OK\",\"N/E\")","v":"N/E"},null,null,null,null,null,null,null,null,null,null,null,null,null,null,null,null,null,null,null,null,null,null,null,null,null,null,null,null,null,null,null,{"$f":"IF(AND(EQ$1<>\"\",COUNTA(U73:EP73)>3),\"OK\",\"N/E\")","v":"N/E"},null,null,null,null,null,null,null,null,null,null,null,null,null,null,null,null,null,null,null,null,null,null,null,null,null,null,null,null,null,null,null,{"$f":"IF(AND(FW$1<>\"\",COUNTA(U73:FV73)>4),\"OK\",\"N/E\")","v":"N/E"}]
[null,{"$f":"N74*D74*$N$69","v":0},0.1,false,null,null,0,0,0,0,null,null,"Un protocole expérimental adapté de recueil de résultats est conçu ou complété, validé et mis en œuvre",0.1,null,null,null,null,null,null,null,null,null,null,null,null,null,null,null,null,null,null,null,null,null,null,null,null,null,null,null,null,null,null,null,null,null,null,null,null,{"$f":"IF(AND(AY$1<>\"\",COUNTA(U74:AX74)>0),\"OK\",\"N/E\")","v":"N/E"},null,null,null,null,null,null,null,null,null,null,null,null,null,null,null,null,null,null,null,null,null,null,null,null,null,null,null,null,null,null,null,{"$f":"IF(AND(CE$1<>\"\",COUNTA(U74:CD74)>1),\"OK\",\"N/E\")","v":"N/E"},null,null,null,null,null,null,null,null,null,null,null,null,null,null,null,null,null,null,null,null,null,null,null,null,null,null,null,null,null,null,null,{"$f":"IF(AND(DK$1<>\"\",COUNTA(U74:DJ74)>2),\"OK\",\"N/E\")","v":"N/E"},null,null,null,null,null,null,null,null,null,null,null,null,null,null,null,null,null,null,null,null,null,null,null,null,null,null,null,null,null,null,null,{"$f":"IF(AND(EQ$1<>\"\",COUNTA(U74:EP74)>3),\"OK\",\"N/E\")","v":"N/E"},null,null,null,null,null,null,null,null,null,null,null,null,null,null,null,null,null,null,null,null,null,null,null,null,null,null,null,null,null,null,null,{"$f":"IF(AND(FW$1<>\"\",COUNTA(U74:FV74)>4),\"OK\",\"N/E\")","v":"N/E"}]
[null,{"$f":"N75*D75*$N$69","v":0},0.05,false,null,null,0,0,0,0,null,null,"Le comportement est précisément décrit",0.05,null,null,null,null,null,null,null,null,null,null,null,null,null,null,null,null,null,null,null,null,null,null,null,null,null,null,null,null,null,null,null,null,null,null,null,null,">",null,null,null,null,null,null,null,null,null,null,null,null,null,null,null,null,null,null,null,null,null,null,null,null,null,null,null,null,null,null,null,">",null,null,null,null,null,null,null,null,null,null,null,null,null,null,null,null,null,null,null,null,null,null,null,null,null,null,null,null,null,null,null,">",null,null,null,null,null,null,null,null,null,null,null,null,null,null,null,null,null,null,null,null,null,null,null,null,null,null,null,null,null,null,null,">",null,null,null,null,null,null,null,null,null,null,null,null,null,null,null,null,null,null,null,null,null,null,null,null,null,null,null,null,null,null,null,">",{"$f":"IF(COUNTA(U75:FW75)>5,\"OK\",\"N/E\")","v":"N/E"}]
[null,null,null,false,null,null,null,null,null,null,null,null,"C2 - Mettre en œuvre un protocole expérimental : Conduire les essais en respectant les consignes de sécurité à partir d’un protocole fourni et traiter les données mesurées en vue d’analyser les écarts"]
[null,{"$f":"N77*D77*$N$69","v":0},0.08,false,null,null,0,0,0,0,null,null,"Les capteurs et appareils de mesure sont correctement mis en œuvre",0.08,null,null,null,null,null,null,null,null,null,null,null,null,null,null,null,null,null,null,null,null,null,null,null,null,null,null,null,null,null,null,null,null,null,null,null,null,{"$f":"IF(AND(AY$1<>\"\",COUNTA(U77:AX77)>0),\"OK\",\"N/E\")","v":"N/E"},null,null,null,null,null,null,null,null,null,null,null,null,null,null,null,null,null,null,null,null,null,null,null,null,null,null,null,null,null,null,null,{"$f":"IF(AND(CE$1<>\"\",COUNTA(U77:CD77)>1),\"OK\",\"N/E\")","v":"N/E"},null,null,null,null,null,null,null,null,null,null,null,null,null,null,null,null,null,null,null,null,null,null,null,null,null,null,null,null,null,null,null,{"$f":"IF(AND(DK$1<>\"\",COUNTA(U77:DJ77)>2),\"OK\",\"N/E\")","v":"N/E"},null,null,null,null,null,null,null,null,null,null,null,null,null,null,null,null,null,null,null,null,null,null,null,null,null,null,null,null,null,null,null,{"$f":"IF(AND(EQ$1<>\"\",COUNTA(U77:EP77)>3),\"OK\",\"N/E\")","v":"N/E"},null,null,null,null,null,null,null,null,null,null,null,null,null,null,null,null,null,null,null,null,null,null,null,null,null,null,null,null,null,null,null,{"$f":"IF(AND(FW$1<>\"\",COUNTA(U77:FV77)>4),\"OK\",\"N/E\")","v":"N/E"}]
[null,0,0.08,false,null,null,0,0,0,0,null,null,"Le système étudié est correctement mis en œuvre",0.08,null,null,null,null,null,null,null,null,null,null,null,null,null,null,null,null,null,null,null,null,null,null,null,null,null,null,null,null,null,null,null,null,null,null,null,null,"N/E",null,null,null,null,null,null,null,null,null,null,null,null,null,null,null,null,null,null,null,null,null,null,null,null,null,null,null,null,null,null,null,"N/E",null,null,null,null,null,null,null,null,null,null,null,null,null,null,null,null,null,null,null,null,null,null,null,null,null,null,null,null,null,null,null,"N/E",null,null,null,null,null,null,null,null,null,null,null,null,null,null,null,null,null,null,null,null,null,null,null,null,null,null,null,null,null,null,null,"N/E",null,null,null,null,null,null,null,null,null,null,null,null,null,null,null,null,null,null,null,null,null,null,null,null,null,null,null,null,null,null,null,"N/E"]
[null,0,0.08,false,null,null,0,0,0,0,null,null,"Les règles de sécurité sont connues et respectées",0.08,null,null,null,null,null,null,null,null,null,null,null,null,null,null,null,null,null,null,null,null,null,null,null,null,null,null,null,null,null,null,null,null,null,null,null,null,"N/E",null,null,null,null,null,null,null,null,null,null,null,null,null,null,null,null,null,null,null,null,null,null,null,null,null,null,null,null,null,null,null,"N/E",null,null,null,null,null,null,null,null,null,null,null,null,null,null,null,null,null,null,null,null,null,null,null,null,null,null,null,null,null,null,null,"N/E",null,null,null,null,null,null,null,null,null,null,null,null,null,null,null,null,null,null,null,null,null,null,null,null,null,null,null,null,null,null,null,"N/E",null,null,null,null,null,null,null,null,null,null,null,null,null,null,null,null,null,null,null,null,null,null,null,null,null,null,null,null,null,null,null,"N/E"]
[null,0,0.09,false,null,null,0,0,0,0,null,null,"Les résultats sont présentés clairement",0.09,null,null,null,null,null,null,null,null,null,null,null,null,null,null,null,null,null,null,null,null,null,null,null,null,null,null,null,null,null,null,null,null,null,null,null,null,"N/E",null,null,null,null,null,null,null,null,null,null,null,null,null,null,null,null,null,null,null,null,null,null,null,null,null,null,null,null,null,null,null,"N/E",null,null,null,null,null,null,null,null,null,null,null,null,null,null,null,null,null,null,null,null,null,null,null,null,null,null,null,null,null,null,null,"N/E",null,null,null,null,null,null,null,null,null,null,null,null,null,null,null,null,null,null,null,null,null,null,null,null,null,null,null,null,null,null,null,"N/E",null,null,null,null,null,null,null,null,null,null,null,null,null,null,null,null,null,null,null,null,null,null,null,null,null,null,null,null,null,null,null,"N/E"]
[null,0,0.1,false,null,null,0,0,0,0,null,null,"Les protocole d'essai est respecté",0.1,null,null,null,null,null,null,null,null,null,null,null,null,null,null,null,null,null,null,null,null,null,null,null,null,null,null,null,null,null,null,null,null,null,null,null,null,"N/E",null,null,null,null,null,null,null,null,null,null,null,null,null,null,null,null,null,null,null,null,null,null,null,null,null,null,null,null,null,null,null,"N/E",null,null,null,null,null,null,null,null,null,null,null,null,null,null,null,null,null,null,null,null,null,null,null,null,null,null,null,null,null,null,null,"N/E",null,null,null,null,null,null,null,null,null,null,null,null,null,null,null,null,null,null,null,null,null,null,null,null,null,null,null,null,null,null,null,"N/E",null,null,null,null,null,null,null,null,null,null,null,null,null,null,null,null,null,null,null,null,null,null,null,null,null,null,null,null,null,null,null,"N/E"]
[null,0,0.09,false,null,null,0,0,0,0,null,null,"Les méthodes et outils de traitement sont cohérents avec le problème posé",0.09,null,null,null,null,null,null,null,null,null,null,null,null,null,null,null,null,null,null,null,null,null,null,null,null,null,null,null,null,null,null,null,null,null,null,null,null,"N/E",null,null,null,null,null,null,null,null,null,null,null,null,null,null,null,null,null,null,null,null,null,null,null,null,null,null,null,null,null,null,null,"N/E",null,null,null,null,null,null,null,null,null,null,null,null,null,null,null,null,null,null,null,null,null,null,null,null,null,null,null,null,null,null,null,"N/E",null,null,null,null,null,null,null,null,null,null,null,null,null,null,null,null,null,null,null,null,null,null,null,null,null,null,null,null,null,null,null,"N/E",null,null,null,null,null,null,null,null,null,null,null,null,null,null,null,null,null,null,null,null,null,null,null,null,null,null,null,null,null,null,null,"N/E"]
[null,0,0.1,false,null,null,0,0,0,0,null,null,"Les résultats sont correctement analysés",0.1,null,null,null,null,null,null,null,null,null,null,null,null,null,null,null,null,null,null,null,null,null,null,null,null,null,null,null,null,null,null,null,null,null,null,null,null,">",null,null,null,null,null,null,null,null,null,null,null,null,null,null,null,null,null,null,null,null,null,null,null,null,null,null,null,null,null,null,null,">",null,null,null,null,null,null,null,null,null,null,null,null,null,null,null,null,null,null,null,null,null,null,null,null,null,null,null,null,null,null,null,">",null,null,null,null,null,null,null,null,null,null,null,null,null,null,null,null,null,null,null,null,null,null,null,null,null,null,null,null,null,null,null,">",null,null,null,null,null,null,null,null,null,null,null,null,null,null,null,null,null,null,null,null,null,null,null,null,null,null,null,null,null,null,null,">",{"$f":"IF(COUNTA(U83:FW83)>5,\"OK\",\"N/E\")","v":"N/E"}]
[null,null,null,false,null,null,null,null,null,null,null,"D","-  Communiquer",0.2]
[null,null,null,false,null,null,null,null,null,null,null,null,"D1 - Rechercher et traiter des informations : Rechercher des informations, analyser, choisir et classer des informations"]
[null,{"$f":"N86*D86*$N$84","v":0},{"$f":"IF(COUNTA(T86:CD86)<>0,N86,0)","v":0.1},false,null,null,0,0,0,0,null,null,"Les outils de recherche documentaire sont bien choisis",0.1,null,null,null,null,null,null,null,null,null,null,null,null,null,null,null,null,null,null,null,null,null,null,null,null,null,null,null,null,null,null,null,null,null,null,null,null,">",null,null,null,null,null,null,null,null,null,null,null,null,null,null,null,null,null,null,null,null,null,null,null,null,null,null,null,null,null,null,null,">",null,null,null,null,null,null,null,null,null,null,null,null,null,null,null,null,null,null,null,null,null,null,null,null,null,null,null,null,null,null,null,">",null,null,null,null,null,null,null,null,null,null,null,null,null,null,null,null,null,null,null,null,null,null,null,null,null,null,null,null,null,null,null,">",null,null,null,null,null,null,null,null,null,null,null,null,null,null,null,null,null,null,null,null,null,null,null,null,null,null,null,null,null,null,null,">",{"$f":"IF(COUNTA(U86:FW86)>5,\"OK\",\"N/E\")","v":"N/E"}]
[null,{"$f":"N87*D87*$N$84","v":0},{"$f":"IF(COUNTA(T87:CD87)<>0,N87,0)","v":0.05},false,null,null,0,0,0,0,null,null,"Les techniques de recherche documentaire sont maîtrisées",0.05,null,null,null,null,null,null,null,null,null,null,null,null,null,null,null,null,null,null,null,null,null,null,null,null,null,null,null,null,null,null,null,null,null,null,null,null,">",null,null,null,null,null,null,null,null,null,null,null,null,null,null,null,null,null,null,null,null,null,null,null,null,null,null,null,null,null,null,null,">",null,null,null,null,null,null,null,null,null,null,null,null,null,null,null,null,null,null,null,null,null,null,null,null,null,null,null,null,null,null,null,">",null,null,null,null,null,null,null,null,null,null,null,null,null,null,null,null,null,null,null,null,null,null,null,null,null,null,null,null,null,null,null,">",null,null,null,null,null,null,null,null,null,null,null,null,null,null,null,null,null,null,null,null,null,null,null,null,null,null,null,null,null,null,null,">",{"$f":"IF(COUNTA(U87:FW87)>5,\"OK\",\"N/E\")","v":"N/E"}]
[null,{"$f":"N88*D88*$N$84","v":0},{"$f":"IF(COUNTA(T88:CD88)<>0,N88,0)","v":0.05},false,null,null,0,0,0,0,null,null,"Les informations conservées sont opportunes",0.05,null,null,null,null,null,null,null,null,null,null,null,null,null,null,null,null,null,null,null,null,null,null,null,null,null,null,null,null,null,null,null,null,null,null,null,null,">",null,null,null,null,null,null,null,null,null,null,null,null,null,null,null,null,null,null,null,null,null,null,null,null,null,null,null,null,null,null,null,">",null,null,null,null,null,null,null,null,null,null,null,null,null,null,null,null,null,null,null,null,null,null,null,null,null,null,null,null,null,null,null,">",null,null,null,null,null,null,null,null,null,null,null,null,null,null,null,null,null,null,null,null,null,null,null,null,null,null,null,null,null,null,null,">",null,null,null,null,null,null,null,null,null,null,null,null,null,null,null,null,null,null,null,null,null,null,null,null,null,null,null,null,null,null,null,">",{"$f":"IF(COUNTA(U88:FW88)>5,\"OK\",\"N/E\")","v":"N/E"}]
[null,{"$f":"N89*D89*$N$84","v":0},{"$f":"IF(COUNTA(T89:CD89)<>0,N89,0)","v":0.1},false,null,null,0,0,0,0,null,null,"Le classement des données permet de les retrouver rapidement",0.1,null,null,null,null,null,null,null,null,null,null,null,null,null,null,null,null,null,null,null,null,null,null,null,null,null,null,null,null,null,null,null,null,null,null,null,null,">",null,null,null,null,null,null,null,null,null,null,null,null,null,null,null,null,null,null,null,null,null,null,null,null,null,null,null,null,null,null,null,">",null,null,null,null,null,null,null,null,null,null,null,null,null,null,null,null,null,null,null,null,null,null,null,null,null,null,null,null,null,null,null,">",null,null,null,null,null,null,null,null,null,null,null,null,null,null,null,null,null,null,null,null,null,null,null,null,null,null,null,null,null,null,null,">",null,null,null,null,null,null,null,null,null,null,null,null,null,null,null,null,null,null,null,null,null,null,null,null,null,null,null,null,null,null,null,">",{"$f":"IF(COUNTA(U89:FW89)>5,\"OK\",\"N/E\")","v":"N/E"}]
[null,null,null,false,null,null,null,null,null,null,null,null,"D2 - Mettre en œuvre une communication : Choisir un support de communication et un média adapté, argumenter, produire un support de communication et adapter sa stratégie de communication au contexte"]
[null,{"$f":"N91*D91*$N$84","v":0},{"$f":"IF(COUNTA(T91:CD91)<>0,N91,0)","v":0.2},false,null,null,0,0,0,0,null,null,"Les outils de communication sont maîtrisés",0.2,null,null,null,null,null,null,null,null,null,null,null,null,null,null,null,null,null,null,null,null,null,null,null,null,null,null,null,null,null,null,null,null,null,null,null,null,">",null,null,null,null,null,null,null,null,null,null,null,null,null,null,null,null,null,null,null,null,null,null,null,null,null,null,null,null,null,null,null,">",null,null,null,null,null,null,null,null,null,null,null,null,null,null,null,null,null,null,null,null,null,null,null,null,null,null,null,null,null,null,null,">",null,null,null,null,null,null,null,null,null,null,null,null,null,null,null,null,null,null,null,null,null,null,null,null,null,null,null,null,null,null,null,">",null,null,null,null,null,null,null,null,null,null,null,null,null,null,null,null,null,null,null,null,null,null,null,null,null,null,null,null,null,null,null,">",{"$f":"IF(COUNTA(U91:FW91)>5,\"OK\",\"N/E\")","v":"N/E"}]
[null,{"$f":"N92*D92*$N$84","v":0},{"$f":"IF(COUNTA(T92:CD92)<>0,N92,0)","v":0.1},false,null,null,0,0,0,0,null,null,"Le support utilisé est adapté",0.1,null,null,null,null,null,null,null,null,null,null,null,null,null,null,null,null,null,null,null,null,null,null,null,null,null,null,null,null,null,null,null,null,null,null,null,null,">",null,null,null,null,null,null,null,null,null,null,null,null,null,null,null,null,null,null,null,null,null,null,null,null,null,null,null,null,null,null,null,">",null,null,null,null,null,null,null,null,null,null,null,null,null,null,null,null,null,null,null,null,null,null,null,null,null,null,null,null,null,null,null,">",null,null,null,null,null,null,null,null,null,null,null,null,null,null,null,null,null,null,null,null,null,null,null,null,null,null,null,null,null,null,null,">",null,null,null,null,null,null,null,null,null,null,null,null,null,null,null,null,null,null,null,null,null,null,null,null,null,null,null,null,null,null,null,">",{"$f":"IF(COUNTA(U92:FW92)>5,\"OK\",\"N/E\")","v":"N/E"}]
[null,{"$f":"N93*D93*$N$84","v":0},{"$f":"IF(COUNTA(T93:CD93)<>0,N93,0)","v":0.2},false,null,null,0,0,0,0,null,null,"La production finale permet la compréhension du problème et de sa résolution ",0.2,null,null,null,null,null,null,null,null,null,null,null,null,null,null,null,null,null,null,null,null,null,null,null,null,null,null,null,null,null,null,null,null,null,null,null,null,">",null,null,null,null,null,null,null,null,null,null,null,null,null,null,null,null,null,null,null,null,null,null,null,null,null,null,null,null,null,null,null,">",null,null,null,null,null,null,null,null,null,null,null,null,null,null,null,null,null,null,null,null,null,null,null,null,null,null,null,null,null,null,null,">",null,null,null,null,null,null,null,null,null,null,null,null,null,null,null,null,null,null,null,null,null,null,null,null,null,null,null,null,null,null,null,">",null,null,null,null,null,null,null,null,null,null,null,null,null,null,null,null,null,null,null,null,null,null,null,null,null,null,null,null,null,null,null,">",{"$f":"IF(COUNTA(U93:FW93)>5,\"OK\",\"N/E\")","v":"N/E"}]
[null,{"$f":"N94*D94*$N$84","v":0},{"$f":"IF(COUNTA(T94:CD94)<>0,N94,0)","v":0.2},false,null,null,0,0,0,0,null,null,"La production respecte le cahier des charges (écrit/oral, texte/vidéo, durée, public visé, …)",0.2,null,null,null,null,null,null,null,null,null,null,null,null,null,null,null,null,null,null,null,null,null,null,null,null,null,null,null,null,null,null,null,null,null,null,null,null,">",null,null,null,null,null,null,null,null,null,null,null,null,null,null,null,null,null,null,null,null,null,null,null,null,null,null,null,null,null,null,null,">",null,null,null,null,null,null,null,null,null,null,null,null,null,null,null,null,null,null,null,null,null,null,null,null,null,null,null,null,null,null,null,">",null,null,null,null,null,null,null,null,null,null,null,null,null,null,null,null,null,null,null,null,null,null,null,null,null,null,null,null,null,null,null,">",null,null,null,null,null,null,null,null,null,null,null,null,null,null,null,null,null,null,null,null,null,null,null,null,null,null,null,null,null,null,null,">",{"$f":"IF(COUNTA(U94:FW94)>5,\"OK\",\"N/E\")","v":"N/E"}]
[null,null,null,{"$f":"IF($B$1>2,TRUE,FALSE)","v":true}]
[null,null,null,{"$f":"IF($B$1>2,TRUE,FALSE)","v":true},null,null,null,null,null,null,null,null,"Evaluation en cours d'année"]
[null,null,null,{"$f":"IF($B$1>2,TRUE,FALSE)","v":true},null,null,null,null,null,null,null,null,"Soutenance finale"]

{"sheet":"Elève C","index":5,"n_rows":97,"n_cols":180,"rows_kept":97,"cut":false,"hidden":false,"merged":[]}
[null,{"$f":"parametres!G4","v":4},null,true,null,null,"IR_t","IR_e","IS_t","IS_e",null,null,{"$f":"CONCATENATE(\"C : \",Synthèse!E23,\" \",Synthèse!F23)","v":"C : eleve C  "},null,null,{"$f":"IF($B$2<>0,H2/G2,\"X\")","v":0.78723404255319152},{"$f":"IF($B$2<>0,J2/I2,\"X\")","v":0.54545454545454541},{"$f":"IF($B$2<>0,(H2+J2)/(G2+I2),0)","v":0.6875},null,{"$f":"TRANSPOSE('Déclinaison projet'!W10:W170)","v":""},"Compléter l’analyse fonctionnelle du système existant","Compléter l’analyse fonctionnelle du système modifié","Compléter le diagramme d’organisation des tâches (WBS)","Compléter le planning et le faire vivre ( diagramme de GANTT)","S'approprier le CDCF ( avec le client éventuellement )","Structurer le travail de groupe ( identifier les découpages possibles)","","","","","","","","","","","","","","","","","","","","","","","","","","","Analyse de la chaine d'énergie du système Fitlux","Evaluer la prodcution d'énergie de la génératrice","","","Proposer une structure d’alimentation photovoltaîque","Evaluer la production d'énergie de 10 m² de panneaux","","","","","","","","","","","","","","","","","","","","","","","","","REVUE DE PROJET - Conception préliminaire","","","","Créée une maquette 3D du Prototype sketchup","","","Déterminer l'interface entre la batterie et la prise électrique","Chiffrer le projet par un devis","Préparer le bon de commande des matériels","","","","","","","","","","","","","","","","","","","","","","","REVUE DE PROJET - Conception détaillée","","Câblage des panneaux photovolaîques","","","Réceptionner le matériel ","Câblage du circuit d'éclairage","Créer une struture du prototype","","Esthétique du prototype","Cablage de l'interface entre la batterie et la prise électrique","","","","","","","","","","","","","","","","","","","","","","REVUE DE PROJET - Réalisation","","","Validation du fonctionnement de la prise électrique 230 V","","","Définir le protocole d' essai ","Piloter le projet ( communiquer … )","Validation des performances / remedier ","","","","","","","","","","","","","","","","","","","","","","","","REVUE DE PROJET - Validation","SOUTENANCE FINALE DU PROJET"]
[null,{"$f":"SUM(B4:B94)","v":80},null,true,null,null,{"$f":"SUM(G4:G94)","v":47},{"$f":"SUM(H4:H94)","v":37},{"$f":"SUM(I4:I94)","v":33},{"$f":"SUM(J4:J94)","v":18},null,null,null,null,null,"Tx Indic. REVUES","Tx Indic. SOUTEN.","Taux Global"]
[]
[null,null,null,{"$f":"IF($B$1>2,TRUE,FALSE)","v":true},null,null,null,null,null,null,null,null,"O1 -  Caractériser des systèmes privilégiant un usage raisonné du point de vue développement durable"]
[null,{"$f":"N5*D5","v":5},{"$f":"IF(FX5=\"OK\",N5,0)","v":0},true,null,null,{"$f":"IF($FX5=\"\",$B5,0)","v":0},{"$f":"IF(OR($AY5=\"OK\",$CE5=\"OK\",$DK5=\"OK\",$EQ5=\"OK\",$FW5=\"OK\"),$B5,0)","v":0},{"$f":"IF($FX5=\"\",0,$B5)","v":5},{"$f":"IF($FX5=\"OK\",$B5,0)","v":0},null,null,"CO1.1. Justifier les choix des matériaux, des structures d’un système et les énergies mises en oeuvre dans une approche de développement durable",5,null,null,null,null,null,null,null,null,null,null,null,null,null,null,null,null,null,null,null,null,null,null,null,null,null,null,null,null,null,null,null,null,null,null,null,null,">",null,null,null,null,null,null,null,null,null,null,null,null,null,null,null,null,null,null,null,null,null,null,null,null,null,null,null,null,null,null,null,">",null,null,null,null,null,null,null,null,null,null,null,null,null,null,null,null,null,null,null,null,null,null,null,null,null,null,null,null,null,null,null,">",null,null,null,null,null,null,null,null,null,null,null,null,null,null,null,null,null,null,null,null,null,null,null,null,null,null,null,null,null,null,null,">",null,null,null,null,null,null,null,null,null,null,null,null,null,null,null,null,null,null,null,null,null,null,null,null,null,null,null,null,null,null,null,">",{"$f":"IF(COUNTA(U5:FW5)>5,\"OK\",\"N/E\")","v":"N/E"}]
[null,3,{"$f":"IF(FX6=\"OK\",N6,0)","v":3},true,null,null,{"$f":"IF($FX6=\"\",$B6,0)","v":0},{"$f":"IF(OR($AY6=\"OK\",$CE6=\"OK\",$DK6=\"OK\",$EQ6=\"OK\",$FW6=\"OK\"),$B6,0)","v":0},{"$f":"IF($FX6=\"\",0,$B6)","v":3},{"$f":"IF($FX6=\"OK\",$B6,0)","v":3},null,null,"CO1.2. Justifier le choix d’une solution selon des contraintes d’ergonomie et d’effets sur la santé de l’homme et du vivant",3,null,null,null,null,null,null,null,null,null,null,null,null,null,null,null,null,null,null,null,null,null,null,null,null,null,null,null,null,null,null,null,null,null,null,null,null,">",null,"x",null,null,null,null,null,null,null,null,null,null,null,null,null,null,null,null,null,null,null,null,null,null,null,null,null,null,null,null,null,">",null,null,null,null,null,null,null,null,null,null,null,null,null,null,null,null,null,null,null,null,null,null,null,null,null,null,null,null,null,null,null,">",null,null,null,null,null,null,null,null,null,null,null,null,null,null,null,null,null,null,null,null,null,null,null,null,null,null,null,null,null,null,null,">",null,null,null,null,null,null,null,null,null,null,null,null,null,null,null,null,null,null,null,null,null,null,null,null,null,null,null,null,null,null,null,">",{"$f":"IF(COUNTA(U6:FW6)>5,\"OK\",\"N/E\")","v":"OK"}]
[null,null,null,true,null,null,null,null,null,null,null,null,"O2 - Identifier les éléments permettant la limitation de l’Impact environnemental d’un système et de ses constituants"]
[null,4,{"$f":"IF(FX8=\"OK\",N8,0)","v":4},true,null,null,0,0,4,4,null,null,"CO2.1. Identifier les flux et la forme de l’énergie, caractériser ses transformations et/ou modulations et estimer l’efficacité énergétique globale d’un système",4,null,null,null,null,null,null,null,null,null,null,null,null,null,null,null,null,null,null,null,null,null,null,null,null,null,null,null,null,null,null,null,null,null,null,null,null,">",null,"x",null,null,null,null,null,null,null,null,null,null,null,null,null,null,null,null,null,null,null,null,null,null,null,null,null,null,null,null,null,">",null,null,null,null,null,null,null,null,null,null,null,null,null,null,null,null,null,null,null,null,null,null,null,null,null,null,null,null,null,null,null,">",null,null,null,null,null,null,null,null,null,null,null,null,null,null,null,null,null,null,null,null,null,null,null,null,null,null,null,null,null,null,null,">",null,null,null,null,null,null,null,null,null,null,null,null,null,null,null,null,null,null,null,null,null,null,null,null,null,null,null,null,null,null,null,">",{"$f":"IF(COUNTA(U8:FW8)>5,\"OK\",\"N/E\")","v":"OK"}]
[null,5,{"$f":"IF(FX9=\"OK\",N9,0)","v":0},true,null,null,0,0,5,0,null,null,"CO2.2. Justifier les solutions constructives d’un système au regard des impacts environnementaux et économiques engendrés tout au long de son cycle de vie",5,null,null,null,null,null,null,null,null,null,null,null,null,null,null,null,null,null,null,null,null,null,null,null,null,null,null,null,null,null,null,null,null,null,null,null,null,">",null,null,null,null,null,null,null,null,null,null,null,null,null,null,null,null,null,null,null,null,null,null,null,null,null,null,null,null,null,null,null,">",null,null,null,null,null,null,null,null,null,null,null,null,null,null,null,null,null,null,null,null,null,null,null,null,null,null,null,null,null,null,null,">",null,null,null,null,null,null,null,null,null,null,null,null,null,null,null,null,null,null,null,null,null,null,null,null,null,null,null,null,null,null,null,">",null,null,null,null,null,null,null,null,null,null,null,null,null,null,null,null,null,null,null,null,null,null,null,null,null,null,null,null,null,null,null,">",{"$f":"IF(COUNTA(U9:FW9)>5,\"OK\",\"N/E\")","v":"N/E"}]
[null,null,null,true,null,null,null,null,null,null,null,null,"O6 - Communiquer une idée, un principe ou une solution technique, un projet, y compris en langue étrangère"]
[null,3,{"$f":"IF(FX11=\"OK\",N11,0)","v":3},true,null,null,0,0,3,3,null,null,"CO6.1. Décrire une idée, un principe, une solution, un projet en utilisant des outils de représentation adaptés",3,null,null,null,null,null,null,null,null,"x",null,null,null,null,null,null,null,null,null,null,null,null,null,null,null,null,null,null,null,null,null,null,null,null,null,null,null,">",null,null,null,null,null,null,null,null,null,null,null,null,null,null,null,null,null,null,null,null,null,null,null,null,null,null,null,null,null,null,null,">",null,null,null,null,null,null,null,null,null,null,null,null,null,null,null,null,null,null,null,null,null,null,null,null,null,null,null,null,null,null,null,">",null,null,null,null,null,null,null,null,null,null,null,null,null,null,null,null,null,null,null,null,null,null,null,null,null,null,null,null,null,null,null,">",null,null,null,null,null,null,null,null,null,null,null,null,null,null,null,null,null,null,null,null,null,null,null,null,null,null,null,null,null,null,null,">",{"$f":"IF(COUNTA(U11:FW11)>5,\"OK\",\"N/E\")","v":"OK"}]
[null,3,{"$f":"IF(FX12=\"OK\",N12,0)","v":3},true,null,null,0,0,3,3,null,null,"CO6.2. Décrire le fonctionnement et/ou l’exploitation d’un système en utilisant l'outil de description le plus pertinent",3,null,null,null,null,null,null,null,null,null,"x",null,null,null,null,null,null,null,null,null,null,null,null,null,null,null,null,null,null,null,null,null,null,null,null,null,null,">",null,null,null,null,null,null,null,null,null,null,null,null,null,null,null,null,null,null,null,null,null,null,null,null,null,null,null,null,null,null,null,">",null,null,null,null,null,null,null,null,null,null,null,null,null,null,null,null,null,null,null,null,null,null,null,null,null,null,null,null,null,null,null,">",null,null,null,null,null,null,null,null,null,null,null,null,null,null,null,null,null,null,null,null,null,null,null,null,null,null,null,null,null,null,null,">",null,null,null,null,null,null,null,null,null,null,null,null,null,null,null,null,null,null,null,null,null,null,null,null,null,null,null,null,null,null,null,">",{"$f":"IF(COUNTA(U12:FW12)>5,\"OK\",\"N/E\")","v":"OK"}]
[null,5,{"$f":"IF(FX13=\"OK\",N13,0)","v":5},true,null,null,0,0,5,5,null,null,"CO6.3. Présenter et argumenter des démarches, des résultats, y compris dans une langue étrangère",5,null,null,null,null,null,null,null,null,null,null,null,null,null,null,null,null,null,null,null,null,null,null,null,null,null,null,null,null,null,null,null,null,null,null,null,null,">",null,null,null,null,null,null,null,null,null,null,null,null,null,null,null,null,null,null,null,null,null,null,null,null,null,null,null,null,null,null,null,">",null,null,null,null,null,null,null,null,null,null,null,null,null,null,null,null,null,null,null,null,null,null,null,null,null,null,null,null,null,null,null,">",null,null,null,null,null,null,null,null,null,null,null,null,null,null,null,null,null,null,null,null,null,null,null,null,null,null,null,null,null,null,null,">",null,null,null,null,null,null,null,"x",null,null,null,null,null,null,null,null,null,null,null,null,null,null,null,null,null,null,null,null,null,null,null,">",{"$f":"IF(COUNTA(U13:FW13)>5,\"OK\",\"N/E\")","v":"OK"}]
[null,null,null,true,null,null,null,null,null,null,null,null,"O7 -  Imaginer une solution, répondre à un besoin"]
[null,0,{"$f":"IF(OR(CE15=\"OK\",EQ15=\"OK\"),N15,0)","v":0},{"$f":"IF($B$1=3,TRUE,FALSE)","v":false},null,null,0,0,0,0,null,null,"CO7.ac1. Participer à une étude architecturale, dans une démarche de développement durable",5,null,null,null,null,null,null,null,null,null,null,null,null,null,null,null,null,null,null,null,null,null,null,null,null,null,null,null,null,null,null,null,null,null,null,null,null,{"$f":"IF(AND(AY$1<>\"\",COUNTA(U15:AX15)>0),\"OK\",\"N/E\")","v":"N/E"},null,null,null,null,null,null,null,null,null,null,null,null,null,null,null,null,null,null,null,null,null,null,null,null,null,null,null,null,null,null,null,{"$f":"IF(AND(CE$1<>\"\",COUNTA(U15:CD15)>1),\"OK\",\"N/E\")","v":"N/E"},null,null,null,null,null,null,null,null,null,null,null,null,null,null,null,null,null,null,null,null,null,null,null,null,null,null,null,null,null,null,null,{"$f":"IF(AND(DK$1<>\"\",COUNTA(U15:DJ15)>2),\"OK\",\"N/E\")","v":"N/E"},null,null,null,null,null,null,null,null,null,null,null,null,null,null,null,null,null,null,null,null,null,null,null,null,null,null,null,null,null,null,null,{"$f":"IF(AND(EQ$1<>\"\",COUNTA(U15:EP15)>3),\"OK\",\"N/E\")","v":"N/E"},null,null,null,null,null,null,null,null,null,null,null,null,null,null,null,null,null,null,null,null,null,null,null,null,null,null,null,null,null,null,null,{"$f":"IF(AND(FW$1<>\"\",COUNTA(U15:FV15)>4),\"OK\",\"N/E\")","v":"N/E"}]
[null,0,0,{"$f":"IF($B$1=3,TRUE,FALSE)","v":false},null,null,0,0,0,0,null,null,"CO7.ac2. Proposer/choisir des solutions techniques répondant aux contraintes et attentes d’une construction",7,null,null,null,null,null,null,null,null,null,null,null,null,null,null,null,null,null,null,null,null,null,null,null,null,null,null,null,null,null,null,null,null,null,null,null,null,{"$f":"IF(AND(AY$1<>\"\",COUNTA(U16:AX16)>0),\"OK\",\"N/E\")","v":"N/E"},null,null,null,null,null,null,null,null,null,null,null,null,null,null,null,null,null,null,null,null,null,null,null,null,null,null,null,null,null,null,null,{"$f":"IF(AND(CE$1<>\"\",COUNTA(U16:CD16)>1),\"OK\",\"N/E\")","v":"N/E"},null,null,null,null,null,null,null,null,null,null,null,null,null,null,null,null,null,null,null,null,null,null,null,null,null,null,null,null,null,null,null,{"$f":"IF(AND(DK$1<>\"\",COUNTA(U16:DJ16)>2),\"OK\",\"N/E\")","v":"N/E"},null,null,null,null,null,null,null,null,null,null,null,null,null,null,null,null,null,null,null,null,null,null,null,null,null,null,null,null,null,null,null,{"$f":"IF(AND(EQ$1<>\"\",COUNTA(U16:EP16)>3),\"OK\",\"N/E\")","v":"N/E"},null,null,null,null,null,null,null,null,null,null,null,null,null,null,null,null,null,null,null,null,null,null,null,null,null,null,null,null,null,null,null,{"$f":"IF(AND(FW$1<>\"\",COUNTA(U16:FV16)>4),\"OK\",\"N/E\")","v":"N/E"}]
[null,0,0,{"$f":"IF($B$1=3,TRUE,FALSE)","v":false},null,null,0,0,0,0,null,null,"CO7.ac3. Concevoir une organisation de réalisation",4,null,null,null,null,null,null,null,null,null,null,null,null,null,null,null,null,null,null,null,null,null,null,null,null,null,null,null,null,null,null,null,null,null,null,null,null,"N/E",null,null,null,null,null,null,null,null,null,null,null,null,null,null,null,null,null,null,null,null,null,null,null,null,null,null,null,null,null,null,null,"N/E",null,null,null,null,null,null,null,null,null,null,null,null,null,null,null,null,null,null,null,null,null,null,null,null,null,null,null,null,null,null,null,"N/E",null,null,null,null,null,null,null,null,null,null,null,null,null,null,null,null,null,null,null,null,null,null,null,null,null,null,null,null,null,null,null,"N/E",null,null,null,null,null,null,null,null,null,null,null,null,null,null,null,null,null,null,null,null,null,null,null,null,null,null,null,null,null,null,null,"N/E"]
[null,7,7,{"$f":"IF($B$1=4,TRUE,FALSE)","v":true},null,null,7,7,0,0,null,null,"CO7.ee1. Participer à une démarche de conception dans le but de proposer plusieurs solutions possibles à un problème technique identifié en lien avec un enjeu énergétique",7,null,null,null,null,null,null,null,null,null,null,null,null,null,null,null,null,null,null,null,null,null,null,null,null,null,null,null,null,null,null,null,null,null,null,null,null,"N/E",null,null,null,null,null,null,null,null,null,null,null,null,null,null,null,null,null,null,null,null,null,null,null,null,null,null,null,null,null,null,null,"N/E",null,null,null,null,null,null,null,null,null,null,null,null,null,null,null,null,null,null,null,null,null,null,null,null,null,null,null,null,null,null,null,"N/E",null,null,null,null,null,null,"x",null,null,null,null,null,null,null,null,null,null,null,null,null,null,null,null,null,null,null,null,null,null,null,null,"OK",null,null,null,null,null,null,null,null,null,null,null,null,null,null,null,null,null,null,null,null,null,null,null,null,null,null,null,null,null,null,null,"OK"]
[null,6,6,{"$f":"IF($B$1=4,TRUE,FALSE)","v":true},null,null,6,6,0,0,null,null,"CO7.ee2. Justifier une solution retenue en intégrant les conséquences des choix sur le triptyque matériau-énergie-information",6,null,null,null,null,null,null,null,null,null,null,null,null,null,null,null,null,null,null,null,null,null,null,null,null,null,null,null,null,null,null,null,null,null,null,null,null,"N/E",null,null,null,null,null,null,null,null,null,null,null,null,null,null,null,null,null,null,null,null,null,null,null,null,null,null,null,null,null,null,null,"N/E",null,null,null,null,null,null,null,"x",null,null,null,null,null,null,null,null,null,null,null,null,null,null,null,null,null,null,null,null,null,null,null,"OK",null,null,null,null,null,null,null,null,null,null,null,null,null,null,null,null,null,null,null,null,null,null,null,null,null,null,null,null,null,null,null,"OK",null,null,null,null,null,null,null,null,null,null,null,null,null,null,null,null,null,null,null,null,null,null,null,null,null,null,null,null,null,null,null,"OK"]
[null,4,4,{"$f":"IF($B$1=4,TRUE,FALSE)","v":true},null,null,4,4,0,0,null,null,"CO7.ee3. Définir la structure, la constitution d’un système en fonction des caractéristiques technico-économiques et environnementales attendues",4,null,null,null,null,null,null,null,null,null,null,null,null,null,null,null,null,null,null,null,null,null,null,null,null,null,null,null,null,null,null,null,null,null,null,null,null,"N/E",null,null,null,null,null,"x",null,null,null,null,null,null,null,null,null,null,null,null,null,null,null,null,null,null,null,null,null,null,null,null,null,"OK",null,null,null,null,null,null,null,null,null,null,null,null,null,null,null,null,null,null,null,null,null,null,null,null,null,null,null,null,null,null,null,"OK",null,null,null,null,null,null,null,null,null,null,null,null,null,null,null,null,null,null,null,null,null,null,null,null,null,null,null,null,null,null,null,"OK",null,null,null,null,null,null,null,null,null,null,null,null,null,null,null,null,null,null,null,null,null,null,null,null,null,null,null,null,null,null,null,"OK"]
[null,4,4,{"$f":"IF($B$1=4,TRUE,FALSE)","v":true},null,null,4,4,0,0,null,null,"CO7.ee4. Définir les modifications de la structure, les choix de constituants et du type de système de gestion d'une chaîne d’énergie afin de répondre à une évolution d’un cahier des charges",4,null,null,null,null,null,null,null,null,null,null,null,null,null,null,null,null,null,null,null,null,null,null,null,null,null,null,null,null,null,null,null,null,null,null,null,null,"N/E",null,null,null,null,null,"x",null,null,null,null,null,null,null,null,null,null,null,null,null,null,null,null,null,null,null,null,null,null,null,null,null,"OK",null,null,null,null,null,null,null,null,null,null,null,null,null,null,null,null,null,null,null,null,null,null,null,null,null,null,null,null,null,null,null,"OK",null,null,null,null,null,null,null,null,null,null,null,null,null,null,null,null,null,null,null,null,null,null,null,null,null,null,null,null,null,null,null,"OK",null,null,null,null,null,null,null,null,null,null,null,null,null,null,null,null,null,null,null,null,null,null,null,null,null,null,null,null,null,null,null,"OK"]
[null,0,0,{"$f":"IF($B$1=5,TRUE,FALSE)","v":false},null,null,0,0,0,0,null,null,"CO7.itec1. Identifier et justifier un problème technique à partir de l’analyse globale d’un système (approche matière-énergie-information)",5,null,null,null,null,null,null,null,null,null,null,null,null,null,null,null,null,null,null,null,null,null,null,null,null,null,null,null,null,null,null,null,null,null,null,null,null,"N/E",null,null,null,null,null,null,null,null,null,null,null,null,null,null,null,null,null,null,null,null,null,null,null,null,null,null,null,null,null,null,null,"N/E",null,null,null,null,null,null,null,null,null,null,null,null,null,null,null,null,null,null,null,null,null,null,null,null,null,null,null,null,null,null,null,"N/E",null,null,null,null,null,null,null,null,null,null,null,null,null,null,null,null,null,null,null,null,null,null,null,null,null,null,null,null,null,null,null,"N/E",null,null,null,null,null,null,null,null,null,null,null,null,null,null,null,null,null,null,null,null,null,null,null,null,null,null,null,null,null,null,null,"N/E"]
[null,0,0,{"$f":"IF($B$1=5,TRUE,FALSE)","v":false},null,null,0,0,0,0,null,null,"CO7.itec2. Proposer des solutions à un problème technique identifié en participant à des démarches de créativité, choisir et justifier la solution retenue",6,null,null,null,null,null,null,null,null,null,null,null,null,null,null,null,null,null,null,null,null,null,null,null,null,null,null,null,null,null,null,null,null,null,null,null,null,"N/E",null,null,null,null,null,null,null,null,null,null,null,null,null,null,null,null,null,null,null,null,null,null,null,null,null,null,null,null,null,null,null,"N/E",null,null,null,null,null,null,null,null,null,null,null,null,null,null,null,null,null,null,null,null,null,null,null,null,null,null,null,null,null,null,null,"N/E",null,null,null,null,null,null,null,null,null,null,null,null,null,null,null,null,null,null,null,null,null,null,null,null,null,null,null,null,null,null,null,"N/E",null,null,null,null,null,null,null,null,null,null,null,null,null,null,null,null,null,null,null,null,null,null,null,null,null,null,null,null,null,null,null,"N/E"]
[null,0,0,{"$f":"IF($B$1=5,TRUE,FALSE)","v":false},null,null,0,0,0,0,null,null,"CO7.itec3. Définir, à l’aide d’un modeleur numérique, les formes et dimensions d'une pièce d'un mécanisme à partir des contraintes fonctionnelles, de son principe de réalisation et de son matériau",3,null,null,null,null,null,null,null,null,null,null,null,null,null,null,null,null,null,null,null,null,null,null,null,null,null,null,null,null,null,null,null,null,null,null,null,null,"N/E",null,null,null,null,null,null,null,null,null,null,null,null,null,null,null,null,null,null,null,null,null,null,null,null,null,null,null,null,null,null,null,"N/E",null,null,null,null,null,null,null,null,null,null,null,null,null,null,null,null,null,null,null,null,null,null,null,null,null,null,null,null,null,null,null,"N/E",null,null,null,null,null,null,null,null,null,null,null,null,null,null,null,null,null,null,null,null,null,null,null,null,null,null,null,null,null,null,null,"N/E",null,null,null,null,null,null,null,null,null,null,null,null,null,null,null,null,null,null,null,null,null,null,null,null,null,null,null,null,null,null,null,"N/E"]
[null,0,0,{"$f":"IF($B$1=5,TRUE,FALSE)","v":false},null,null,0,0,0,0,null,null,"CO7.itec4. Définir, à l’aide d’un modeleur numérique, les modifications d'un mécanisme à partir des contraintes fonctionnelles",2,null,null,null,null,null,null,null,null,null,null,null,null,null,null,null,null,null,null,null,null,null,null,null,null,null,null,null,null,null,null,null,null,null,null,null,null,"N/E",null,null,null,null,null,null,null,null,null,null,null,null,null,null,null,null,null,null,null,null,null,null,null,null,null,null,null,null,null,null,null,"N/E",null,null,null,null,null,null,null,null,null,null,null,null,null,null,null,null,null,null,null,null,null,null,null,null,null,null,null,null,null,null,null,"N/E",null,null,null,null,null,null,null,null,null,null,null,null,null,null,null,null,null,null,null,null,null,null,null,null,null,null,null,null,null,null,null,"N/E",null,null,null,null,null,null,null,null,null,null,null,null,null,null,null,null,null,null,null,null,null,null,null,null,null,null,null,null,null,null,null,"N/E"]
[null,0,0,{"$f":"IF($B$1=6,TRUE,FALSE)","v":false},null,null,0,0,0,0,null,null,"CO7.sin1. Décoder la notice technique d’un système, vérifier la conformité du fonctionnement",4,null,null,null,null,null,null,null,null,null,null,null,null,null,null,null,null,null,null,null,null,null,null,null,null,null,null,null,null,null,null,null,null,null,null,null,null,"N/E",null,null,null,null,null,null,null,null,null,null,null,null,null,null,null,null,null,null,null,null,null,null,null,null,null,null,null,null,null,null,null,"N/E",null,null,null,null,null,null,null,null,null,null,null,null,null,null,null,null,null,null,null,null,null,null,null,null,null,null,null,null,null,null,null,"N/E",null,null,null,null,null,null,null,null,null,null,null,null,null,null,null,null,null,null,null,null,null,null,null,null,null,null,null,null,null,null,null,"N/E",null,null,null,null,null,null,null,null,null,null,null,null,null,null,null,null,null,null,null,null,null,null,null,null,null,null,null,null,null,null,null,"N/E"]
[null,0,0,{"$f":"IF($B$1=6,TRUE,FALSE)","v":false},null,null,0,0,0,0,null,null,"CO7.sin2. Décoder le cahier des charges fonctionnel décrivant le besoin exprimé, identifier la fonction définie par un besoin exprimé, faire des mesures pour caractériser cette fonction et conclure sur sa conformité",5,null,null,null,null,null,null,null,null,null,null,null,null,null,null,null,null,null,null,null,null,null,null,null,null,null,null,null,null,null,null,null,null,null,null,null,null,"N/E",null,null,null,null,null,null,null,null,null,null,null,null,null,null,null,null,null,null,null,null,null,null,null,null,null,null,null,null,null,null,null,"N/E",null,null,null,null,null,null,null,null,null,null,null,null,null,null,null,null,null,null,null,null,null,null,null,null,null,null,null,null,null,null,null,"N/E",null,null,null,null,null,null,null,null,null,null,null,null,null,null,null,null,null,null,null,null,null,null,null,null,null,null,null,null,null,null,null,"N/E",null,null,null,null,null,null,null,null,null,null,null,null,null,null,null,null,null,null,null,null,null,null,null,null,null,null,null,null,null,null,null,"N/E"]
[null,0,0,{"$f":"IF($B$1=6,TRUE,FALSE)","v":false},null,null,0,0,0,0,null,null,"CO7.sin3. Exprimer le principe de fonctionnement d’un système à partir des diagrammes SysML pertinents Repérer les constituants de la chaîne d’énergie et d’information",4,null,null,null,null,null,null,null,null,null,null,null,null,null,null,null,null,null,null,null,null,null,null,null,null,null,null,null,null,null,null,null,null,null,null,null,null,"N/E",null,null,null,null,null,null,null,null,null,null,null,null,null,null,null,null,null,null,null,null,null,null,null,null,null,null,null,null,null,null,null,"N/E",null,null,null,null,null,null,null,null,null,null,null,null,null,null,null,null,null,null,null,null,null,null,null,null,null,null,null,null,null,null,null,"N/E",null,null,null,null,null,null,null,null,null,null,null,null,null,null,null,null,null,null,null,null,null,null,null,null,null,null,null,null,null,null,null,"N/E",null,null,null,null,null,null,null,null,null,null,null,null,null,null,null,null,null,null,null,null,null,null,null,null,null,null,null,null,null,null,null,"N/E"]
[null,null,null,{"$f":"IF($B$1>2,TRUE,FALSE)","v":true},null,null,null,null,null,null,null,null,"O8 -Valider des solutions techniques"]
[null,0,{"$f":"IF(OR(CE30=\"OK\",EQ30=\"OK\"),N30,0)","v":0},{"$f":"IF($B$1=3,TRUE,FALSE)","v":false},null,null,0,0,0,0,null,null,"CO8.ac1. Simuler un comportement structurel, thermique et acoustique de tout ou partie d’une construction",4,null,null,null,null,null,null,null,null,null,null,null,null,null,null,null,null,null,null,null,null,null,null,null,null,null,null,null,null,null,null,null,null,null,null,null,null,{"$f":"IF(AND(AY$1<>\"\",COUNTA(U30:AX30)>0),\"OK\",\"N/E\")","v":"N/E"},null,null,null,null,null,null,null,null,null,null,null,null,null,null,null,null,null,null,null,null,null,null,null,null,null,null,null,null,null,null,null,{"$f":"IF(AND(CE$1<>\"\",COUNTA(U30:CD30)>1),\"OK\",\"N/E\")","v":"N/E"},null,null,null,null,null,null,null,null,null,null,null,null,null,null,null,null,null,null,null,null,null,null,null,null,null,null,null,null,null,null,null,{"$f":"IF(AND(DK$1<>\"\",COUNTA(U30:DJ30)>2),\"OK\",\"N/E\")","v":"N/E"},null,null,null,null,null,null,null,null,null,null,null,null,null,null,null,null,null,null,null,null,null,null,null,null,null,null,null,null,null,null,null,{"$f":"IF(AND(EQ$1<>\"\",COUNTA(U30:EP30)>3),\"OK\",\"N/E\")","v":"N/E"},null,null,null,null,null,null,null,null,null,null,null,null,null,null,null,null,null,null,null,null,null,null,null,null,null,null,null,null,null,null,null,{"$f":"IF(AND(FW$1<>\"\",COUNTA(U30:FV30)>4),\"OK\",\"N/E\")","v":"N/E"}]
[null,0,0,{"$f":"IF($B$1=3,TRUE,FALSE)","v":false},null,null,0,0,0,0,null,null,"CO8.ac2. Analyser les résultats issus de simulations ou d’essais de laboratoire",4,null,null,null,null,null,null,null,null,null,null,null,null,null,null,null,null,null,null,null,null,null,null,null,null,null,null,null,null,null,null,null,null,null,null,null,null,"N/E",null,null,null,null,null,null,null,null,null,null,null,null,null,null,null,null,null,null,null,null,null,null,null,null,null,null,null,null,null,null,null,"N/E",null,null,null,null,null,null,null,null,null,null,null,null,null,null,null,null,null,null,null,null,null,null,null,null,null,null,null,null,null,null,null,"N/E",null,null,null,null,null,null,null,null,null,null,null,null,null,null,null,null,null,null,null,null,null,null,null,null,null,null,null,null,null,null,null,"N/E",null,null,null,null,null,null,null,null,null,null,null,null,null,null,null,null,null,null,null,null,null,null,null,null,null,null,null,null,null,null,null,"N/E"]
[null,0,0,{"$f":"IF($B$1=3,TRUE,FALSE)","v":false},null,null,0,0,0,0,null,null,"CO8.ac3. Analyser/valider les choix structurels et de confort",4,null,null,null,null,null,null,null,null,null,null,null,null,null,null,null,null,null,null,null,null,null,null,null,null,null,null,null,null,null,null,null,null,null,null,null,null,"N/E",null,null,null,null,null,null,null,null,null,null,null,null,null,null,null,null,null,null,null,null,null,null,null,null,null,null,null,null,null,null,null,"N/E",null,null,null,null,null,null,null,null,null,null,null,null,null,null,null,null,null,null,null,null,null,null,null,null,null,null,null,null,null,null,null,"N/E",null,null,null,null,null,null,null,null,null,null,null,null,null,null,null,null,null,null,null,null,null,null,null,null,null,null,null,null,null,null,null,"N/E",null,null,null,null,null,null,null,null,null,null,null,null,null,null,null,null,null,null,null,null,null,null,null,null,null,null,null,null,null,null,null,"N/E"]
[null,3,0,{"$f":"IF($B$1=4,TRUE,FALSE)","v":true},null,null,3,0,0,0,null,null,"CO8.ee1. Renseigner un logiciel de simulation du comportement énergétique avec les caractéristiques du système et les paramètres externes pour un point de fonctionnement donné",3,null,null,null,null,null,null,null,null,null,null,null,null,null,null,null,null,null,null,null,null,null,null,null,null,null,null,null,null,null,null,null,null,null,null,null,null,"N/E",null,null,null,null,null,null,null,null,null,null,null,null,null,null,null,null,null,null,null,null,null,null,null,null,null,null,null,null,null,null,null,"N/E",null,null,null,null,null,null,null,null,null,null,null,null,null,null,null,null,null,null,null,null,null,null,null,null,null,null,null,null,null,null,null,"N/E",null,null,null,null,null,null,null,null,null,null,null,null,null,null,null,null,null,null,null,null,null,null,null,null,null,null,null,null,null,null,null,"N/E",null,null,null,null,null,null,null,null,null,null,null,null,null,null,null,null,null,null,null,null,null,null,null,null,null,null,null,null,null,null,null,"N/E"]
[null,4,0,{"$f":"IF($B$1=4,TRUE,FALSE)","v":true},null,null,4,0,0,0,null,null,"CO8.ee2. Interpréter les résultats d'une simulation afin de valider une solution ou l’optimiser",4,null,null,null,null,null,null,null,null,null,null,null,null,null,null,null,null,null,null,null,null,null,null,null,null,null,null,null,null,null,null,null,null,null,null,null,null,"N/E",null,null,null,null,null,null,null,null,null,null,null,null,null,null,null,null,null,null,null,null,null,null,null,null,null,null,null,null,null,null,null,"N/E",null,null,null,null,null,null,null,null,null,null,null,null,null,null,null,null,null,null,null,null,null,null,null,null,null,null,null,null,null,null,null,"N/E",null,null,null,null,null,null,null,null,null,null,null,null,null,null,null,null,null,null,null,null,null,null,null,null,null,null,null,null,null,null,null,"N/E",null,null,null,null,null,null,null,null,null,null,null,null,null,null,null,null,null,null,null,null,null,null,null,null,null,null,null,null,null,null,null,"N/E"]
[null,3,0,{"$f":"IF($B$1=4,TRUE,FALSE)","v":true},null,null,3,0,0,0,null,null,"CO8.ee3. Comparer et interpréter le résultat d'une simulation d'un comportement d’un système avec un comportement réel",3,null,null,null,null,null,null,null,null,null,null,null,null,null,null,null,null,null,null,null,null,null,null,null,null,null,null,null,null,null,null,null,null,null,null,null,null,"N/E",null,null,null,null,null,null,null,null,null,null,null,null,null,null,null,null,null,null,null,null,null,null,null,null,null,null,null,null,null,null,null,"N/E",null,null,null,null,null,null,null,null,null,null,null,null,null,null,null,null,null,null,null,null,null,null,null,null,null,null,null,null,null,null,null,"N/E",null,null,null,null,null,null,null,null,null,null,null,null,null,null,null,null,null,null,null,null,null,null,null,null,null,null,null,null,null,null,null,"N/E",null,null,null,null,null,null,null,null,null,null,null,null,null,null,null,null,null,null,null,null,null,null,null,null,null,null,null,null,null,null,null,"N/E"]
[null,5,0,{"$f":"IF($B$1=4,TRUE,FALSE)","v":true},null,null,5,5,0,0,null,null,"CO8.ee4. Mettre en oeuvre un protocole d’essais et de mesures sur le prototype d’une chaîne d’énergie, interpréter les résultats",5,null,null,null,null,null,null,null,null,null,null,null,null,null,null,null,null,null,null,null,null,null,null,null,null,null,null,null,null,null,null,null,null,null,null,null,null,"N/E",null,null,null,null,null,null,null,null,null,null,null,null,null,null,null,null,null,null,null,null,null,null,null,null,null,null,null,null,null,null,null,"N/E",null,null,null,null,null,null,null,null,null,null,null,null,null,null,null,null,null,null,null,null,null,null,null,null,null,null,null,null,null,null,null,"N/E",null,null,null,null,null,null,null,null,null,null,null,null,null,null,null,null,null,null,null,null,null,null,null,null,null,null,null,null,null,null,null,"N/E",null,null,"x",null,null,null,null,null,null,null,null,null,null,null,null,null,null,null,null,null,null,null,null,null,null,null,null,null,null,null,null,"OK"]
[null,0,0,{"$f":"IF($B$1=5,TRUE,FALSE)","v":false},null,null,0,0,0,0,null,null,"CO8.itec1. Paramétrer un logiciel de simulation mécanique pour obtenir les caractéristiques d'une loi d'entrée/sortie d'un mécanisme simple",3,null,null,null,null,null,null,null,null,null,null,null,null,null,null,null,null,null,null,null,null,null,null,null,null,null,null,null,null,null,null,null,null,null,null,null,null,"N/E",null,null,null,null,null,null,null,null,null,null,null,null,null,null,null,null,null,null,null,null,null,null,null,null,null,null,null,null,null,null,null,"N/E",null,null,null,null,null,null,null,null,null,null,null,null,null,null,null,null,null,null,null,null,null,null,null,null,null,null,null,null,null,null,null,"N/E",null,null,null,null,null,null,null,null,null,null,null,null,null,null,null,null,null,null,null,null,null,null,null,null,null,null,null,null,null,null,null,"N/E",null,null,null,null,null,null,null,null,null,null,null,null,null,null,null,null,null,null,null,null,null,null,null,null,null,null,null,null,null,null,null,"N/E"]
[null,0,0,{"$f":"IF($B$1=5,TRUE,FALSE)","v":false},null,null,0,0,0,0,null,null,"CO8.itec2. Interpréter les résultats d'une simulation mécanique pour valider une solution ou modifier une pièce ou un mécanisme",4,null,null,null,null,null,null,null,null,null,null,null,null,null,null,null,null,null,null,null,null,null,null,null,null,null,null,null,null,null,null,null,null,null,null,null,null,"N/E",null,null,null,null,null,null,null,null,null,null,null,null,null,null,null,null,null,null,null,null,null,null,null,null,null,null,null,null,null,null,null,"N/E",null,null,null,null,null,null,null,null,null,null,null,null,null,null,null,null,null,null,null,null,null,null,null,null,null,null,null,null,null,null,null,"N/E",null,null,null,null,null,null,null,null,null,null,null,null,null,null,null,null,null,null,null,null,null,null,null,null,null,null,null,null,null,null,null,"N/E",null,null,null,null,null,null,null,null,null,null,null,null,null,null,null,null,null,null,null,null,null,null,null,null,null,null,null,null,null,null,null,"N/E"]
[null,0,0,{"$f":"IF($B$1=5,TRUE,FALSE)","v":false},null,null,0,0,0,0,null,null,"CO8.itec3. Mettre en oeuvre un protocole d’essais et de mesures, interpréter les résultats",5,null,null,null,null,null,null,null,null,null,null,null,null,null,null,null,null,null,null,null,null,null,null,null,null,null,null,null,null,null,null,null,null,null,null,null,null,"N/E",null,null,null,null,null,null,null,null,null,null,null,null,null,null,null,null,null,null,null,null,null,null,null,null,null,null,null,null,null,null,null,"N/E",null,null,null,null,null,null,null,null,null,null,null,null,null,null,null,null,null,null,null,null,null,null,null,null,null,null,null,null,null,null,null,"N/E",null,null,null,null,null,null,null,null,null,null,null,null,null,null,null,null,null,null,null,null,null,null,null,null,null,null,null,null,null,null,null,"N/E",null,null,null,null,null,null,null,null,null,null,null,null,null,null,null,null,null,null,null,null,null,null,null,null,null,null,null,null,null,null,null,"N/E"]
[null,0,0,{"$f":"IF($B$1=5,TRUE,FALSE)","v":false},null,null,0,0,0,0,null,null,"CO8.itec4. Comparer et interpréter le résultat d'une simulation d'un comportement mécanique avec un comportement réel",3,null,null,null,null,null,null,null,null,null,null,null,null,null,null,null,null,null,null,null,null,null,null,null,null,null,null,null,null,null,null,null,null,null,null,null,null,"N/E",null,null,null,null,null,null,null,null,null,null,null,null,null,null,null,null,null,null,null,null,null,null,null,null,null,null,null,null,null,null,null,"N/E",null,null,null,null,null,null,null,null,null,null,null,null,null,null,null,null,null,null,null,null,null,null,null,null,null,null,null,null,null,null,null,"N/E",null,null,null,null,null,null,null,null,null,null,null,null,null,null,null,null,null,null,null,null,null,null,null,null,null,null,null,null,null,null,null,"N/E",null,null,null,null,null,null,null,null,null,null,null,null,null,null,null,null,null,null,null,null,null,null,null,null,null,null,null,null,null,null,null,"N/E"]
[null,0,0,{"$f":"IF($B$1=6,TRUE,FALSE)","v":false},null,null,0,0,0,0,null,null,"CO8.sin1. Rechercher et choisir une solution logicielle ou matérielle au regard de la définition d'un système",3,null,null,null,null,null,null,null,null,null,null,null,null,null,null,null,null,null,null,null,null,null,null,null,null,null,null,null,null,null,null,null,null,null,null,null,null,"N/E",null,null,null,null,null,null,null,null,null,null,null,null,null,null,null,null,null,null,null,null,null,null,null,null,null,null,null,null,null,null,null,"N/E",null,null,null,null,null,null,null,null,null,null,null,null,null,null,null,null,null,null,null,null,null,null,null,null,null,null,null,null,null,null,null,"N/E",null,null,null,null,null,null,null,null,null,null,null,null,null,null,null,null,null,null,null,null,null,null,null,null,null,null,null,null,null,null,null,"N/E",null,null,null,null,null,null,null,null,null,null,null,null,null,null,null,null,null,null,null,null,null,null,null,null,null,null,null,null,null,null,null,"N/E"]
[null,0,0,{"$f":"IF($B$1=6,TRUE,FALSE)","v":false},null,null,0,0,0,0,null,null,"CO8.sin2. Établir pour une fonction précédemment identifiée un modèle de comportement à partir de mesures faites sur le système",4,null,null,null,null,null,null,null,null,null,null,null,null,null,null,null,null,null,null,null,null,null,null,null,null,null,null,null,null,null,null,null,null,null,null,null,null,"N/E",null,null,null,null,null,null,null,null,null,null,null,null,null,null,null,null,null,null,null,null,null,null,null,null,null,null,null,null,null,null,null,"N/E",null,null,null,null,null,null,null,null,null,null,null,null,null,null,null,null,null,null,null,null,null,null,null,null,null,null,null,null,null,null,null,"N/E",null,null,null,null,null,null,null,null,null,null,null,null,null,null,null,null,null,null,null,null,null,null,null,null,null,null,null,null,null,null,null,"N/E",null,null,null,null,null,null,null,null,null,null,null,null,null,null,null,null,null,null,null,null,null,null,null,null,null,null,null,null,null,null,null,"N/E"]
[null,0,0,{"$f":"IF($B$1=6,TRUE,FALSE)","v":false},null,null,0,0,0,0,null,null,"CO8.sin3. Traduire sous forme graphique l’architecture de la chaîne d’information identifiée pour un système et définir les paramètres d’utilisation du simulateur",3,null,null,null,null,null,null,null,null,null,null,null,null,null,null,null,null,null,null,null,null,null,null,null,null,null,null,null,null,null,null,null,null,null,null,null,null,"N/E",null,null,null,null,null,null,null,null,null,null,null,null,null,null,null,null,null,null,null,null,null,null,null,null,null,null,null,null,null,null,null,"N/E",null,null,null,null,null,null,null,null,null,null,null,null,null,null,null,null,null,null,null,null,null,null,null,null,null,null,null,null,null,null,null,"N/E",null,null,null,null,null,null,null,null,null,null,null,null,null,null,null,null,null,null,null,null,null,null,null,null,null,null,null,null,null,null,null,"N/E",null,null,null,null,null,null,null,null,null,null,null,null,null,null,null,null,null,null,null,null,null,null,null,null,null,null,null,null,null,null,null,"N/E"]
[null,0,0,{"$f":"IF($B$1=6,TRUE,FALSE)","v":false},null,null,0,0,0,0,null,null,"CO8.sin4. Identifier les variables simulées et mesurées sur un système pour valider le choix d’une solution",4,null,null,null,null,null,null,null,null,null,null,null,null,null,null,null,null,null,null,null,null,null,null,null,null,null,null,null,null,null,null,null,null,null,null,null,null,"N/E",null,null,null,null,null,null,null,null,null,null,null,null,null,null,null,null,null,null,null,null,null,null,null,null,null,null,null,null,null,null,null,"N/E",null,null,null,null,null,null,null,null,null,null,null,null,null,null,null,null,null,null,null,null,null,null,null,null,null,null,null,null,null,null,null,"N/E",null,null,null,null,null,null,null,null,null,null,null,null,null,null,null,null,null,null,null,null,null,null,null,null,null,null,null,null,null,null,null,"N/E",null,null,null,null,null,null,null,null,null,null,null,null,null,null,null,null,null,null,null,null,null,null,null,null,null,null,null,null,null,null,null,"N/E"]
[null,5,{"$f":"IF(FX45=\"OK\",N45,0)","v":0},{"$f":"IF($B$1>2,TRUE,FALSE)","v":true},null,null,0,0,5,0,null,null,"CO8.es Justifier des éléments d'une simulation relative au comportement de tout ou partie d'un système et les écarts par rapport au réel",5,null,null,null,null,null,null,null,null,null,null,null,null,null,null,null,null,null,null,null,null,null,null,null,null,null,null,null,null,null,null,null,null,null,null,null,null,">",null,null,null,null,null,null,null,null,null,null,null,null,null,null,null,null,null,null,null,null,null,null,null,null,null,null,null,null,null,null,null,">",null,null,null,null,null,null,null,null,null,null,null,null,null,null,null,null,null,null,null,null,null,null,null,null,null,null,null,null,null,null,null,">",null,null,null,null,null,null,null,null,null,null,null,null,null,null,null,null,null,null,null,null,null,null,null,null,null,null,null,null,null,null,null,">",null,null,null,null,null,null,null,null,null,null,null,null,null,null,null,null,null,null,null,null,null,null,null,null,null,null,null,null,null,null,null,">",{"$f":"IF(COUNTA(U45:FW45)>5,\"OK\",\"N/E\")","v":"N/E"}]
[null,null,null,{"$f":"IF($B$1>2,TRUE,FALSE)","v":true},null,null,null,null,null,null,null,null,"O9 – Gérer la vie du produit"]
[null,0,{"$f":"IF(OR(CE47=\"OK\",EQ47=\"OK\"),N47,0)","v":0},{"$f":"IF($B$1=3,TRUE,FALSE)","v":false},null,null,0,0,0,0,null,null,"CO9.ac1. Améliorer les performances d’une construction du point de vue énergétique, domotique et informationnel",5,null,null,null,null,null,null,null,null,null,null,null,null,null,null,null,null,null,null,null,null,null,null,null,null,null,null,null,null,null,null,null,null,null,null,null,null,{"$f":"IF(AND(AY$1<>\"\",COUNTA(U47:AX47)>0),\"OK\",\"N/E\")","v":"N/E"},null,null,null,null,null,null,null,null,null,null,null,null,null,null,null,null,null,null,null,null,null,null,null,null,null,null,null,null,null,null,null,{"$f":"IF(AND(CE$1<>\"\",COUNTA(U47:CD47)>1),\"OK\",\"N/E\")","v":"N/E"},null,null,null,null,null,null,null,null,null,null,null,null,null,null,null,null,null,null,null,null,null,null,null,null,null,null,null,null,null,null,null,{"$f":"IF(AND(DK$1<>\"\",COUNTA(U47:DJ47)>2),\"OK\",\"N/E\")","v":"N/E"},null,null,null,null,null,null,null,null,null,null,null,null,null,null,null,null,null,null,null,null,null,null,null,null,null,null,null,null,null,null,null,{"$f":"IF(AND(EQ$1<>\"\",COUNTA(U47:EP47)>3),\"OK\",\"N/E\")","v":"N/E"},null,null,null,null,null,null,null,null,null,null,null,null,null,null,null,null,null,null,null,null,null,null,null,null,null,null,null,null,null,null,null,{"$f":"IF(AND(FW$1<>\"\",COUNTA(U47:FV47)>4),\"OK\",\"N/E\")","v":"N/E"}]
[null,0,0,{"$f":"IF($B$1=3,TRUE,FALSE)","v":false},null,null,0,0,0,0,null,null,"CO9.ac2. Identifier et décrire les causes de désordre dans une construction",3,null,null,null,null,null,null,null,null,null,null,null,null,null,null,null,null,null,null,null,null,null,null,null,null,null,null,null,null,null,null,null,null,null,null,null,null,"N/E",null,null,null,null,null,null,null,null,null,null,null,null,null,null,null,null,null,null,null,null,null,null,null,null,null,null,null,null,null,null,null,"N/E",null,null,null,null,null,null,null,null,null,null,null,null,null,null,null,null,null,null,null,null,null,null,null,null,null,null,null,null,null,null,null,"N/E",null,null,null,null,null,null,null,null,null,null,null,null,null,null,null,null,null,null,null,null,null,null,null,null,null,null,null,null,null,null,null,"N/E",null,null,null,null,null,null,null,null,null,null,null,null,null,null,null,null,null,null,null,null,null,null,null,null,null,null,null,null,null,null,null,"N/E"]
[null,0,0,{"$f":"IF($B$1=3,TRUE,FALSE)","v":false},null,null,0,0,0,0,null,null,"CO9.ac3. Valoriser la fin de vie du produit : déconstruction, gestion des déchets, valorisation des produits",3,null,null,null,null,null,null,null,null,null,null,null,null,null,null,null,null,null,null,null,null,null,null,null,null,null,null,null,null,null,null,null,null,null,null,null,null,"N/E",null,null,null,null,null,null,null,null,null,null,null,null,null,null,null,null,null,null,null,null,null,null,null,null,null,null,null,null,null,null,null,"N/E",null,null,null,null,null,null,null,null,null,null,null,null,null,null,null,null,null,null,null,null,null,null,null,null,null,null,null,null,null,null,null,"N/E",null,null,null,null,null,null,null,null,null,null,null,null,null,null,null,null,null,null,null,null,null,null,null,null,null,null,null,null,null,null,null,"N/E",null,null,null,null,null,null,null,null,null,null,null,null,null,null,null,null,null,null,null,null,null,null,null,null,null,null,null,null,null,null,null,"N/E"]
[null,3,3,{"$f":"IF($B$1=4,TRUE,FALSE)","v":true},null,null,3,3,0,0,null,null,"CO9.ee1. Expérimenter des procédés de stockage, de production, de transport, de transformation, d’énergie pour aider à la conception d’une chaîne d’énergie",3,null,null,null,null,null,null,null,null,null,null,null,null,null,null,null,null,null,null,null,null,null,null,null,null,null,null,null,null,null,null,null,null,null,null,null,null,"N/E",null,null,null,null,null,null,null,null,null,null,null,null,null,null,null,null,null,null,null,null,null,null,null,null,null,null,null,null,null,null,null,"N/E",null,null,null,null,null,null,null,null,null,null,null,null,null,null,null,null,null,null,null,null,null,null,null,null,null,null,null,null,null,null,null,"N/E",null,null,null,null,"x",null,null,null,null,null,null,null,null,null,null,null,null,null,null,null,null,null,null,null,null,null,null,null,null,null,null,"OK",null,null,null,null,null,null,null,null,null,null,null,null,null,null,null,null,null,null,null,null,null,null,null,null,null,null,null,null,null,null,null,"OK"]
[null,4,4,{"$f":"IF($B$1=4,TRUE,FALSE)","v":true},null,null,4,4,0,0,null,null,"CO9.ee2. Réaliser et valider un prototype obtenu en réponse à tout ou partie du cahier des charges initial",4,null,null,null,null,null,null,null,null,null,null,null,null,null,null,null,null,null,null,null,null,null,null,null,null,null,null,null,null,null,null,null,null,null,null,null,null,"N/E",null,null,null,null,null,null,null,null,null,null,null,null,null,null,null,null,null,null,null,null,null,null,null,null,null,null,null,null,null,null,null,"N/E",null,null,null,null,null,null,null,null,null,null,null,null,null,null,null,null,null,null,null,null,null,null,null,null,null,null,null,null,null,null,null,"N/E",null,null,null,null,null,"x",null,null,null,null,null,null,null,null,null,null,null,null,null,null,null,null,null,null,null,null,null,null,null,null,null,"OK",null,null,null,null,null,null,null,null,null,null,null,null,null,null,null,null,null,null,null,null,null,null,null,null,null,null,null,null,null,null,null,"OK"]
[null,4,4,{"$f":"IF($B$1=4,TRUE,FALSE)","v":true},null,null,4,4,0,0,null,null,"CO9.ee3. Intégrer un prototype dans un système à modifier pour valider son comportement et ses performances",4,null,null,null,null,null,null,null,null,null,null,null,null,null,null,null,null,null,null,null,null,null,null,null,null,null,null,null,null,null,null,null,null,null,null,null,null,"N/E",null,null,null,null,null,null,null,null,null,null,null,null,null,null,null,null,null,null,null,null,null,null,null,null,null,null,null,null,null,null,null,"N/E",null,null,null,null,null,null,null,null,null,null,null,null,null,null,null,null,null,null,null,null,null,null,null,null,null,null,null,null,null,null,null,"N/E",null,null,null,null,null,"x",null,null,null,null,null,null,null,null,null,null,null,null,null,null,null,null,null,null,null,null,null,null,null,null,null,"OK",null,null,null,null,null,null,null,null,null,null,null,null,null,null,null,null,null,null,null,null,null,null,null,null,null,null,null,null,null,null,null,"OK"]
[null,0,0,{"$f":"IF($B$1=5,TRUE,FALSE)","v":false},null,null,0,0,0,0,null,null,"CO9.itec1. Expérimenter des procédés pour caractériser les paramètres de transformation de la matière et leurs conséquences sur la définition et l’obtention de pièces",3,null,null,null,null,null,null,null,null,null,null,null,null,null,null,null,null,null,null,null,null,null,null,null,null,null,null,null,null,null,null,null,null,null,null,null,null,"N/E",null,null,null,null,null,null,null,null,null,null,null,null,null,null,null,null,null,null,null,null,null,null,null,null,null,null,null,null,null,null,null,"N/E",null,null,null,null,null,null,null,null,null,null,null,null,null,null,null,null,null,null,null,null,null,null,null,null,null,null,null,null,null,null,null,"N/E",null,null,null,null,null,null,null,null,null,null,null,null,null,null,null,null,null,null,null,null,null,null,null,null,null,null,null,null,null,null,null,"N/E",null,null,null,null,null,null,null,null,null,null,null,null,null,null,null,null,null,null,null,null,null,null,null,null,null,null,null,null,null,null,null,"N/E"]
[null,0,0,{"$f":"IF($B$1=5,TRUE,FALSE)","v":false},null,null,0,0,0,0,null,null,"CO9.itec2. Réaliser et valider un prototype obtenu par rapport à tout ou partie du cahier des charges initial",4,null,null,null,null,null,null,null,null,null,null,null,null,null,null,null,null,null,null,null,null,null,null,null,null,null,null,null,null,null,null,null,null,null,null,null,null,"N/E",null,null,null,null,null,null,null,null,null,null,null,null,null,null,null,null,null,null,null,null,null,null,null,null,null,null,null,null,null,null,null,"N/E",null,null,null,null,null,null,null,null,null,null,null,null,null,null,null,null,null,null,null,null,null,null,null,null,null,null,null,null,null,null,null,"N/E",null,null,null,null,null,null,null,null,null,null,null,null,null,null,null,null,null,null,null,null,null,null,null,null,null,null,null,null,null,null,null,"N/E",null,null,null,null,null,null,null,null,null,null,null,null,null,null,null,null,null,null,null,null,null,null,null,null,null,null,null,null,null,null,null,"N/E"]
[null,0,0,{"$f":"IF($B$1=5,TRUE,FALSE)","v":false},null,null,0,0,0,0,null,null,"CO9.itec3. Intégrer les pièces prototypes dans le système à modifier pour valider son comportement et ses performances",4,null,null,null,null,null,null,null,null,null,null,null,null,null,null,null,null,null,null,null,null,null,null,null,null,null,null,null,null,null,null,null,null,null,null,null,null,"N/E",null,null,null,null,null,null,null,null,null,null,null,null,null,null,null,null,null,null,null,null,null,null,null,null,null,null,null,null,null,null,null,"N/E",null,null,null,null,null,null,null,null,null,null,null,null,null,null,null,null,null,null,null,null,null,null,null,null,null,null,null,null,null,null,null,"N/E",null,null,null,null,null,null,null,null,null,null,null,null,null,null,null,null,null,null,null,null,null,null,null,null,null,null,null,null,null,null,null,"N/E",null,null,null,null,null,null,null,null,null,null,null,null,null,null,null,null,null,null,null,null,null,null,null,null,null,null,null,null,null,null,null,"N/E"]
[null,0,0,{"$f":"IF($B$1=6,TRUE,FALSE)","v":false},null,null,0,0,0,0,null,null,"CO9.sin1. Utiliser les outils adaptés pour planifier un projet (diagramme de Gantt, chemin critique, données économiques, réunions de projet)",3,null,null,null,null,null,null,null,null,null,null,null,null,null,null,null,null,null,null,null,null,null,null,null,null,null,null,null,null,null,null,null,null,null,null,null,null,"N/E",null,null,null,null,null,null,null,null,null,null,null,null,null,null,null,null,null,null,null,null,null,null,null,null,null,null,null,null,null,null,null,"N/E",null,null,null,null,null,null,null,null,null,null,null,null,null,null,null,null,null,null,null,null,null,null,null,null,null,null,null,null,null,null,null,"N/E",null,null,null,null,null,null,null,null,null,null,null,null,null,null,null,null,null,null,null,null,null,null,null,null,null,null,null,null,null,null,null,"N/E",null,null,null,null,null,null,null,null,null,null,null,null,null,null,null,null,null,null,null,null,null,null,null,null,null,null,null,null,null,null,null,"N/E"]
[null,0,0,{"$f":"IF($B$1=6,TRUE,FALSE)","v":false},null,null,0,0,0,0,null,null,"CO9.sin2. Installer, configurer et instrumenter un système réel Mettre en oeuvre la chaîne d’acquisition puis acquérir, traiter, transmettre et restituer l’information",5,null,null,null,null,null,null,null,null,null,null,null,null,null,null,null,null,null,null,null,null,null,null,null,null,null,null,null,null,null,null,null,null,null,null,null,null,"N/E",null,null,null,null,null,null,null,null,null,null,null,null,null,null,null,null,null,null,null,null,null,null,null,null,null,null,null,null,null,null,null,"N/E",null,null,null,null,null,null,null,null,null,null,null,null,null,null,null,null,null,null,null,null,null,null,null,null,null,null,null,null,null,null,null,"N/E",null,null,null,null,null,null,null,null,null,null,null,null,null,null,null,null,null,null,null,null,null,null,null,null,null,null,null,null,null,null,null,"N/E",null,null,null,null,null,null,null,null,null,null,null,null,null,null,null,null,null,null,null,null,null,null,null,null,null,null,null,null,null,null,null,"N/E"]
[null,0,0,{"$f":"IF($B$1=6,TRUE,FALSE)","v":false},null,null,0,0,0,0,null,null,"CO9.sin3. Rechercher des évolutions de constituants dans le cadre d’une démarche de veille technologique, analyser la structure d'un système pour intervenir sur les constituants dans le cadre d'une opération de maintenance",4,null,null,null,null,null,null,null,null,null,null,null,null,null,null,null,null,null,null,null,null,null,null,null,null,null,null,null,null,null,null,null,null,null,null,null,null,"N/E",null,null,null,null,null,null,null,null,null,null,null,null,null,null,null,null,null,null,null,null,null,null,null,null,null,null,null,null,null,null,null,"N/E",null,null,null,null,null,null,null,null,null,null,null,null,null,null,null,null,null,null,null,null,null,null,null,null,null,null,null,null,null,null,null,"N/E",null,null,null,null,null,null,null,null,null,null,null,null,null,null,null,null,null,null,null,null,null,null,null,null,null,null,null,null,null,null,null,"N/E",null,null,null,null,null,null,null,null,null,null,null,null,null,null,null,null,null,null,null,null,null,null,null,null,null,null,null,null,null,null,null,"N/E"]
[null,0,0,{"$f":"IF($B$1=6,TRUE,FALSE)","v":false},null,null,0,0,0,0,null,null,"CO9.sin4. Rechercher et choisir de nouveaux constituants d’un système (ou d’un projet finalisé) au regard d’évolutions technologiques, socio-économiques spécifiées dans un cahier des charges. Organiser le projet permettant de « maquettiser » la solution choisie",5,null,null,null,null,null,null,null,null,null,null,null,null,null,null,null,null,null,null,null,null,null,null,null,null,null,null,null,null,null,null,null,null,null,null,null,null,"N/E",null,null,null,null,null,null,null,null,null,null,null,null,null,null,null,null,null,null,null,null,null,null,null,null,null,null,null,null,null,null,null,"N/E",null,null,null,null,null,null,null,null,null,null,null,null,null,null,null,null,null,null,null,null,null,null,null,null,null,null,null,null,null,null,null,"N/E",null,null,null,null,null,null,null,null,null,null,null,null,null,null,null,null,null,null,null,null,null,null,null,null,null,null,null,null,null,null,null,"N/E",null,null,null,null,null,null,null,null,null,null,null,null,null,null,null,null,null,null,null,null,null,null,null,null,null,null,null,null,null,null,null,"N/E"]
[null,null,null,{"$f":"IF($B$1=2,TRUE,FALSE)","v":false},null,null,null,null,null,null,null,"B","-  Modéliser",0.4]
[null,null,null,false,null,null,null,null,null,null,null,null,"B3 - Résoudre et simuler : Simuler le fonctionnement de tout ou partie d’un système à l’aide d’un modèle fourni"]
[null,{"$f":"N62*D62*$N$60","v":0},{"$f":"IF(COUNTA(T62:CD62)<>0,N62,0)","v":0.2},false,null,null,0,0,0,0,null,null,"Les paramètres influents sont identifiés",0.2,null,null,null,null,null,null,null,null,null,null,null,null,null,null,null,null,null,null,null,null,null,null,null,null,null,null,null,null,null,null,null,null,null,null,null,null,{"$f":"IF(AND(AY$1<>\"\",COUNTA(U62:AX62)>0),\"OK\",\"N/E\")","v":"N/E"},null,null,null,null,null,null,null,null,null,null,null,null,null,null,null,null,null,null,null,null,null,null,null,null,null,null,null,null,null,null,null,{"$f":"IF(AND(CE$1<>\"\",COUNTA(U62:CD62)>1),\"OK\",\"N/E\")","v":"N/E"},null,null,null,null,null,null,null,null,null,null,null,null,null,null,null,null,null,null,null,null,null,null,null,null,null,null,null,null,null,null,null,{"$f":"IF(AND(DK$1<>\"\",COUNTA(U62:DJ62)>2),\"OK\",\"N/E\")","v":"N/E"},null,null,null,null,null,null,null,null,null,null,null,null,null,null,null,null,null,null,null,null,null,null,null,null,null,null,null,null,null,null,null,{"$f":"IF(AND(EQ$1<>\"\",COUNTA(U62:EP62)>3),\"OK\",\"N/E\")","v":"N/E"},null,null,null,null,null,null,null,null,null,null,null,null,null,null,null,null,null,null,null,null,null,null,null,null,null,null,null,null,null,null,null,{"$f":"IF(AND(FW$1<>\"\",COUNTA(U62:FV62)>4),\"OK\",\"N/E\")","v":"N/E"}]
[null,{"$f":"N63*D63*$N$60","v":0},0.2,false,null,null,0,0,0,0,null,null,"Les limites de simulation sont correctement définies",0.2,null,null,null,null,null,null,null,null,null,null,null,null,null,null,null,null,null,null,null,null,null,null,null,null,null,null,null,null,null,null,null,null,null,null,null,null,{"$f":"IF(AND(AY$1<>\"\",COUNTA(U63:AX63)>0),\"OK\",\"N/E\")","v":"N/E"},null,null,null,null,null,null,null,null,null,null,null,null,null,null,null,null,null,null,null,null,null,null,null,null,null,null,null,null,null,null,null,{"$f":"IF(AND(CE$1<>\"\",COUNTA(U63:CD63)>1),\"OK\",\"N/E\")","v":"N/E"},null,null,null,null,null,null,null,null,null,null,null,null,null,null,null,null,null,null,null,null,null,null,null,null,null,null,null,null,null,null,null,{"$f":"IF(AND(DK$1<>\"\",COUNTA(U63:DJ63)>2),\"OK\",\"N/E\")","v":"N/E"},null,null,null,null,null,null,null,null,null,null,null,null,null,null,null,null,null,null,null,null,null,null,null,null,null,null,null,null,null,null,null,{"$f":"IF(AND(EQ$1<>\"\",COUNTA(U63:EP63)>3),\"OK\",\"N/E\")","v":"N/E"},null,null,null,null,null,null,null,null,null,null,null,null,null,null,null,null,null,null,null,null,null,null,null,null,null,null,null,null,null,null,null,{"$f":"IF(AND(FW$1<>\"\",COUNTA(U63:FV63)>4),\"OK\",\"N/E\")","v":"N/E"}]
[null,null,null,false,null,null,null,null,null,null,null,null,"B4 - Valider un modèle : Valider un modèle fourni, interpréter les résultats obtenus, préciser les limites de validité du modèle utilisé et modifier les paramètres du modèle pour répondre au cahier des charges ou aux résultats expérimentaux"]
[null,{"$f":"N65*D65*$N$60","v":0},0.15,false,null,null,0,0,0,0,null,null,"Les résultats sont correctement interprétés",0.15,null,null,null,null,null,null,null,null,null,null,null,null,null,null,null,null,null,null,null,null,null,null,null,null,null,null,null,null,null,null,null,null,null,null,null,null,">",null,null,null,null,null,null,null,null,null,null,null,null,null,null,null,null,null,null,null,null,null,null,null,null,null,null,null,null,null,null,null,">",null,null,null,null,null,null,null,null,null,null,null,null,null,null,null,null,null,null,null,null,null,null,null,null,null,null,null,null,null,null,null,">",null,null,null,null,null,null,null,null,null,null,null,null,null,null,null,null,null,null,null,null,null,null,null,null,null,null,null,null,null,null,null,">",null,null,null,null,null,null,null,null,null,null,null,null,null,null,null,null,null,null,null,null,null,null,null,null,null,null,null,null,null,null,null,">",{"$f":"IF(COUNTA(U65:FW65)>5,\"OK\",\"N/E\")","v":"N/E"}]
[null,{"$f":"N66*D66*$N$60","v":0},0.15,false,null,null,0,0,0,0,null,null,"Ces limites sont explicitées",0.15,null,null,null,null,null,null,null,null,null,null,null,null,null,null,null,null,null,null,null,null,null,null,null,null,null,null,null,null,null,null,null,null,null,null,null,null,">",null,null,null,null,null,null,null,null,null,null,null,null,null,null,null,null,null,null,null,null,null,null,null,null,null,null,null,null,null,null,null,">",null,null,null,null,null,null,null,null,null,null,null,null,null,null,null,null,null,null,null,null,null,null,null,null,null,null,null,null,null,null,null,">",null,null,null,null,null,null,null,null,null,null,null,null,null,null,null,null,null,null,null,null,null,null,null,null,null,null,null,null,null,null,null,">",null,null,null,null,null,null,null,null,null,null,null,null,null,null,null,null,null,null,null,null,null,null,null,null,null,null,null,null,null,null,null,">",{"$f":"IF(COUNTA(U66:FW66)>5,\"OK\",\"N/E\")","v":"N/E"}]
[null,{"$f":"N67*D67*$N$60","v":0},0.15,false,null,null,0,0,0,0,null,null,"Les paramètres modifiés sont pertinents",0.15,null,null,null,null,null,null,null,null,null,null,null,null,null,null,null,null,null,null,null,null,null,null,null,null,null,null,null,null,null,null,null,null,null,null,null,null,">",null,null,null,null,null,null,null,null,null,null,null,null,null,null,null,null,null,null,null,null,null,null,null,null,null,null,null,null,null,null,null,">",null,null,null,null,null,null,null,null,null,null,null,null,null,null,null,null,null,null,null,null,null,null,null,null,null,null,null,null,null,null,null,">",null,null,null,null,null,null,null,null,null,null,null,null,null,null,null,null,null,null,null,null,null,null,null,null,null,null,null,null,null,null,null,">",null,null,null,null,null,null,null,null,null,null,null,null,null,null,null,null,null,null,null,null,null,null,null,null,null,null,null,null,null,null,null,">",{"$f":"IF(COUNTA(U67:FW67)>5,\"OK\",\"N/E\")","v":"N/E"}]
[null,{"$f":"N68*D68*$N$60","v":0},0.15,false,null,null,0,0,0,0,null,null,"Le modèle modifié répond aux attentes ",0.15,null,null,null,null,null,null,null,null,null,null,null,null,null,null,null,null,null,null,null,null,null,null,null,null,null,null,null,null,null,null,null,null,null,null,null,null,">",null,null,null,null,null,null,null,null,null,null,null,null,null,null,null,null,null,null,null,null,null,null,null,null,null,null,null,null,null,null,null,">",null,null,null,null,null,null,null,null,null,null,null,null,null,null,null,null,null,null,null,null,null,null,null,null,null,null,null,null,null,null,null,">",null,null,null,null,null,null,null,null,null,null,null,null,null,null,null,null,null,null,null,null,null,null,null,null,null,null,null,null,null,null,null,">",null,null,null,null,null,null,null,null,null,null,null,null,null,null,null,null,null,null,null,null,null,null,null,null,null,null,null,null,null,null,null,">",{"$f":"IF(COUNTA(U68:FW68)>5,\"OK\",\"N/E\")","v":"N/E"}]
[null,null,null,false,null,null,null,null,null,null,null,"C","-  Expérimenter",0.4]
[null,null,null,false,null,null,null,null,null,null,null,null," C1 - Justifier le choix d’un protocole expérimental : Identifier les grandeurs physiques à mesurer, décrire une chaîne d'acquisition, identifier le comportement des composants et justifier le choix des essais réalisés"]
[null,{"$f":"N71*D71*$N$69","v":0},{"$f":"IF(COUNTA(T71:CD71)<>0,N71,0)","v":0.08},false,null,null,{"$f":"IF($FX71=\"\",$B71,0)","v":0},{"$f":"IF(OR($AY71=\"OK\",$CE71=\"OK\",$DK71=\"OK\",$EQ71=\"OK\",$FW71=\"OK\"),$B71,0)","v":0},{"$f":"IF($FX71=\"\",0,$B71)","v":0},{"$f":"IF($FX71=\"OK\",$B71,0)","v":0},null,null,"Les grandeurs spécifiques (d'entrée, sortie, matière d'œuvre…) sont correctement identifiées",0.08,null,null,null,null,null,null,null,null,null,null,null,null,null,null,null,null,null,null,null,null,null,null,null,null,null,null,null,null,null,null,null,null,null,null,null,null,{"$f":"IF(AND(AY$1<>\"\",COUNTA(U71:AX71)>0),\"OK\",\"N/E\")","v":"N/E"},null,null,null,null,null,null,null,null,null,null,null,null,null,null,null,null,null,null,null,null,null,null,null,null,null,null,null,null,null,null,null,{"$f":"IF(AND(CE$1<>\"\",COUNTA(U71:CD71)>1),\"OK\",\"N/E\")","v":"N/E"},null,null,null,null,null,null,null,null,null,null,null,null,null,null,null,null,null,null,null,null,null,null,null,null,null,null,null,null,null,null,null,{"$f":"IF(AND(DK$1<>\"\",COUNTA(U71:DJ71)>2),\"OK\",\"N/E\")","v":"N/E"},null,null,null,null,null,null,null,null,null,null,null,null,null,null,null,null,null,null,null,null,null,null,null,null,null,null,null,null,null,null,null,{"$f":"IF(AND(EQ$1<>\"\",COUNTA(U71:EP71)>3),\"OK\",\"N/E\")","v":"N/E"},null,null,null,null,null,null,null,null,null,null,null,null,null,null,null,null,null,null,null,null,null,null,null,null,null,null,null,null,null,null,null,{"$f":"IF(AND(FW$1<>\"\",COUNTA(U71:FV71)>4),\"OK\",\"N/E\")","v":"N/E"}]
[null,{"$f":"N72*D72*$N$69","v":0},0.08,false,null,null,0,0,0,0,null,null,"Les éléments de la chaîne sont correctement identifiés ",0.08,null,null,null,null,null,null,null,null,null,null,null,null,null,null,null,null,null,null,null,null,null,null,null,null,null,null,null,null,null,null,null,null,null,null,null,null,{"$f":"IF(AND(AY$1<>\"\",COUNTA(U72:AX72)>0),\"OK\",\"N/E\")","v":"N/E"},null,null,null,null,null,null,null,null,null,null,null,null,null,null,null,null,null,null,null,null,null,null,null,null,null,null,null,null,null,null,null,{"$f":"IF(AND(CE$1<>\"\",COUNTA(U72:CD72)>1),\"OK\",\"N/E\")","v":"N/E"},null,null,null,null,null,null,null,null,null,null,null,null,null,null,null,null,null,null,null,null,null,null,null,null,null,null,null,null,null,null,null,{"$f":"IF(AND(DK$1<>\"\",COUNTA(U72:DJ72)>2),\"OK\",\"N/E\")","v":"N/E"},null,null,null,null,null,null,null,null,null,null,null,null,null,null,null,null,null,null,null,null,null,null,null,null,null,null,null,null,null,null,null,{"$f":"IF(AND(EQ$1<>\"\",COUNTA(U72:EP72)>3),\"OK\",\"N/E\")","v":"N/E"},null,null,null,null,null,null,null,null,null,null,null,null,null,null,null,null,null,null,null,null,null,null,null,null,null,null,null,null,null,null,null,{"$f":"IF(AND(FW$1<>\"\",COUNTA(U72:FV72)>4),\"OK\",\"N/E\")","v":"N/E"}]
[null,{"$f":"N73*D73*$N$69","v":0},7.0000000000000007E-2,false,null,null,0,0,0,0,null,null,"Les choix et réglages des capteurs et appareils de mesure sont correctement explicités",7.0000000000000007E-2,null,null,null,null,null,null,null,null,null,null,null,null,null,null,null,null,null,null,null,null,null,null,null,null,null,null,null,null,null,null,null,null,null,null,null,null,{"$f":"IF(AND(AY$1<>\"\",COUNTA(U73:AX73)>0),\"OK\",\"N/E\")","v":"N/E"},null,null,null,null,null,null,null,null,null,null,null,null,null,null,null,null,null,null,null,null,null,null,null,null,null,null,null,null,null,null,null,{"$f":"IF(AND(CE$1<>\"\",COUNTA(U73:CD73)>1),\"OK\",\"N/E\")","v":"N/E"},null,null,null,null,null,null,null,null,null,null,null,null,null,null,null,null,null,null,null,null,null,null,null,null,null,null,null,null,null,null,null,{"$f":"IF(AND(DK$1<>\"\",COUNTA(U73:DJ73)>2),\"OK\",\"N/E\")","v":"N/E"},null,null,null,null,null,null,null,null,null,null,null,null,null,null,null,null,null,null,null,null,null,null,null,null,null,null,null,null,null,null,null,{"$f":"IF(AND(EQ$1<>\"\",COUNTA(U73:EP73)>3),\"OK\",\"N/E\")","v":"N/E"},null,null,null,null,null,null,null,null,null,null,null,null,null,null,null,null,null,null,null,null,null,null,null,null,null,null,null,null,null,null,null,{"$f":"IF(AND(FW$1<>\"\",COUNTA(U73:FV73)>4),\"OK\",\"N/E\")","v":"N/E"}]
[null,{"$f":"N74*D74*$N$69","v":0},0.1,false,null,null,0,0,0,0,null,null,"Un protocole expérimental adapté de recueil de résultats est conçu ou complété, validé et mis en œuvre",0.1,null,null,null,null,null,null,null,null,null,null,null,null,null,null,null,null,null,null,null,null,null,null,null,null,null,null,null,null,null,null,null,null,null,null,null,null,{"$f":"IF(AND(AY$1<>\"\",COUNTA(U74:AX74)>0),\"OK\",\"N/E\")","v":"N/E"},null,null,null,null,null,null,null,null,null,null,null,null,null,null,null,null,null,null,null,null,null,null,null,null,null,null,null,null,null,null,null,{"$f":"IF(AND(CE$1<>\"\",COUNTA(U74:CD74)>1),\"OK\",\"N/E\")","v":"N/E"},null,null,null,null,null,null,null,null,null,null,null,null,null,null,null,null,null,null,null,null,null,null,null,null,null,null,null,null,null,null,null,{"$f":"IF(AND(DK$1<>\"\",COUNTA(U74:DJ74)>2),\"OK\",\"N/E\")","v":"N/E"},null,null,null,null,null,null,null,null,null,null,null,null,null,null,null,null,null,null,null,null,null,null,null,null,null,null,null,null,null,null,null,{"$f":"IF(AND(EQ$1<>\"\",COUNTA(U74:EP74)>3),\"OK\",\"N/E\")","v":"N/E"},null,null,null,null,null,null,null,null,null,null,null,null,null,null,null,null,null,null,null,null,null,null,null,null,null,null,null,null,null,null,null,{"$f":"IF(AND(FW$1<>\"\",COUNTA(U74:FV74)>4),\"OK\",\"N/E\")","v":"N/E"}]
[null,{"$f":"N75*D75*$N$69","v":0},0.05,false,null,null,0,0,0,0,null,null,"Le comportement est précisément décrit",0.05,null,null,null,null,null,null,null,null,null,null,null,null,null,null,null,null,null,null,null,null,null,null,null,null,null,null,null,null,null,null,null,null,null,null,null,null,">",null,null,null,null,null,null,null,null,null,null,null,null,null,null,null,null,null,null,null,null,null,null,null,null,null,null,null,null,null,null,null,">",null,null,null,null,null,null,null,null,null,null,null,null,null,null,null,null,null,null,null,null,null,null,null,null,null,null,null,null,null,null,null,">",null,null,null,null,null,null,null,null,null,null,null,null,null,null,null,null,null,null,null,null,null,null,null,null,null,null,null,null,null,null,null,">",null,null,null,null,null,null,null,null,null,null,null,null,null,null,null,null,null,null,null,null,null,null,null,null,null,null,null,null,null,null,null,">",{"$f":"IF(COUNTA(U75:FW75)>5,\"OK\",\"N/E\")","v":"N/E"}]
[null,null,null,false,null,null,null,null,null,null,null,null,"C2 - Mettre en œuvre un protocole expérimental : Conduire les essais en respectant les consignes de sécurité à partir d’un protocole fourni et traiter les données mesurées en vue d’analyser les écarts"]
[null,{"$f":"N77*D77*$N$69","v":0},0.08,false,null,null,0,0,0,0,null,null,"Les capteurs et appareils de mesure sont correctement mis en œuvre",0.08,null,null,null,null,null,null,null,null,null,null,null,null,null,null,null,null,null,null,null,null,null,null,null,null,null,null,null,null,null,null,null,null,null,null,null,null,{"$f":"IF(AND(AY$1<>\"\",COUNTA(U77:AX77)>0),\"OK\",\"N/E\")","v":"N/E"},null,null,null,null,null,null,null,null,null,null,null,null,null,null,null,null,null,null,null,null,null,null,null,null,null,null,null,null,null,null,null,{"$f":"IF(AND(CE$1<>\"\",COUNTA(U77:CD77)>1),\"OK\",\"N/E\")","v":"N/E"},null,null,null,null,null,null,null,null,null,null,null,null,null,null,null,null,null,null,null,null,null,null,null,null,null,null,null,null,null,null,null,{"$f":"IF(AND(DK$1<>\"\",COUNTA(U77:DJ77)>2),\"OK\",\"N/E\")","v":"N/E"},null,null,null,null,null,null,null,null,null,null,null,null,null,null,null,null,null,null,null,null,null,null,null,null,null,null,null,null,null,null,null,{"$f":"IF(AND(EQ$1<>\"\",COUNTA(U77:EP77)>3),\"OK\",\"N/E\")","v":"N/E"},null,null,null,null,null,null,null,null,null,null,null,null,null,null,null,null,null,null,null,null,null,null,null,null,null,null,null,null,null,null,null,{"$f":"IF(AND(FW$1<>\"\",COUNTA(U77:FV77)>4),\"OK\",\"N/E\")","v":"N/E"}]
[null,0,0.08,false,null,null,0,0,0,0,null,null,"Le système étudié est correctement mis en œuvre",0.08,null,null,null,null,null,null,null,null,null,null,null,null,null,null,null,null,null,null,null,null,null,null,null,null,null,null,null,null,null,null,null,null,null,null,null,null,"N/E",null,null,null,null,null,null,null,null,null,null,null,null,null,null,null,null,null,null,null,null,null,null,null,null,null,null,null,null,null,null,null,"N/E",null,null,null,null,null,null,null,null,null,null,null,null,null,null,null,null,null,null,null,null,null,null,null,null,null,null,null,null,null,null,null,"N/E",null,null,null,null,null,null,null,null,null,null,null,null,null,null,null,null,null,null,null,null,null,null,null,null,null,null,null,null,null,null,null,"N/E",null,null,null,null,null,null,null,null,null,null,null,null,null,null,null,null,null,null,null,null,null,null,null,null,null,null,null,null,null,null,null,"N/E"]
[null,0,0.08,false,null,null,0,0,0,0,null,null,"Les règles de sécurité sont connues et respectées",0.08,null,null,null,null,null,null,null,null,null,null,null,null,null,null,null,null,null,null,null,null,null,null,null,null,null,null,null,null,null,null,null,null,null,null,null,null,"N/E",null,null,null,null,null,null,null,null,null,null,null,null,null,null,null,null,null,null,null,null,null,null,null,null,null,null,null,null,null,null,null,"N/E",null,null,null,null,null,null,null,null,null,null,null,null,null,null,null,null,null,null,null,null,null,null,null,null,null,null,null,null,null,null,null,"N/E",null,null,null,null,null,null,null,null,null,null,null,null,null,null,null,null,null,null,null,null,null,null,null,null,null,null,null,null,null,null,null,"N/E",null,null,null,null,null,null,null,null,null,null,null,null,null,null,null,null,null,null,null,null,null,null,null,null,null,null,null,null,null,null,null,"N/E"]
[null,0,0.09,false,null,null,0,0,0,0,null,null,"Les résultats sont présentés clairement",0.09,null,null,null,null,null,null,null,null,null,null,null,null,null,null,null,null,null,null,null,null,null,null,null,null,null,null,null,null,null,null,null,null,null,null,null,null,"N/E",null,null,null,null,null,null,null,null,null,null,null,null,null,null,null,null,null,null,null,null,null,null,null,null,null,null,null,null,null,null,null,"N/E",null,null,null,null,null,null,null,null,null,null,null,null,null,null,null,null,null,null,null,null,null,null,null,null,null,null,null,null,null,null,null,"N/E",null,null,null,null,null,null,null,null,null,null,null,null,null,null,null,null,null,null,null,null,null,null,null,null,null,null,null,null,null,null,null,"N/E",null,null,null,null,null,null,null,null,null,null,null,null,null,null,null,null,null,null,null,null,null,null,null,null,null,null,null,null,null,null,null,"N/E"]
[null,0,0.1,false,null,null,0,0,0,0,null,null,"Les protocole d'essai est respecté",0.1,null,null,null,null,null,null,null,null,null,null,null,null,null,null,null,null,null,null,null,null,null,null,null,null,null,null,null,null,null,null,null,null,null,null,null,null,"N/E",null,null,null,null,null,null,null,null,null,null,null,null,null,null,null,null,null,null,null,null,null,null,null,null,null,null,null,null,null,null,null,"N/E",null,null,null,null,null,null,null,null,null,null,null,null,null,null,null,null,null,null,null,null,null,null,null,null,null,null,null,null,null,null,null,"N/E",null,null,null,null,null,null,null,null,null,null,null,null,null,null,null,null,null,null,null,null,null,null,null,null,null,null,null,null,null,null,null,"N/E",null,null,null,null,null,null,null,null,null,null,null,null,null,null,null,null,null,null,null,null,null,null,null,null,null,null,null,null,null,null,null,"N/E"]
[null,0,0.09,false,null,null,0,0,0,0,null,null,"Les méthodes et outils de traitement sont cohérents avec le problème posé",0.09,null,null,null,null,null,null,null,null,null,null,null,null,null,null,null,null,null,null,null,null,null,null,null,null,null,null,null,null,null,null,null,null,null,null,null,null,"N/E",null,null,null,null,null,null,null,null,null,null,null,null,null,null,null,null,null,null,null,null,null,null,null,null,null,null,null,null,null,null,null,"N/E",null,null,null,null,null,null,null,null,null,null,null,null,null,null,null,null,null,null,null,null,null,null,null,null,null,null,null,null,null,null,null,"N/E",null,null,null,null,null,null,null,null,null,null,null,null,null,null,null,null,null,null,null,null,null,null,null,null,null,null,null,null,null,null,null,"N/E",null,null,null,null,null,null,null,null,null,null,null,null,null,null,null,null,null,null,null,null,null,null,null,null,null,null,null,null,null,null,null,"N/E"]
[null,0,0.1,false,null,null,0,0,0,0,null,null,"Les résultats sont correctement analysés",0.1,null,null,null,null,null,null,null,null,null,null,null,null,null,null,null,null,null,null,null,null,null,null,null,null,null,null,null,null,null,null,null,null,null,null,null,null,">",null,null,null,null,null,null,null,null,null,null,null,null,null,null,null,null,null,null,null,null,null,null,null,null,null,null,null,null,null,null,null,">",null,null,null,null,null,null,null,null,null,null,null,null,null,null,null,null,null,null,null,null,null,null,null,null,null,null,null,null,null,null,null,">",null,null,null,null,null,null,null,null,null,null,null,null,null,null,null,null,null,null,null,null,null,null,null,null,null,null,null,null,null,null,null,">",null,null,null,null,null,null,null,null,null,null,null,null,null,null,null,null,null,null,null,null,null,null,null,null,null,null,null,null,null,null,null,">",{"$f":"IF(COUNTA(U83:FW83)>5,\"OK\",\"N/E\")","v":"N/E"}]
[null,null,null,false,null,null,null,null,null,null,null,"D","-  Communiquer",0.2]
[null,null,null,false,null,null,null,null,null,null,null,null,"D1 - Rechercher et traiter des informations : Rechercher des informations, analyser, choisir et classer des informations"]
[null,{"$f":"N86*D86*$N$84","v":0},{"$f":"IF(COUNTA(T86:CD86)<>0,N86,0)","v":0.1},false,null,null,0,0,0,0,null,null,"Les outils de recherche documentaire sont bien choisis",0.1,null,null,null,null,null,null,null,null,null,null,null,null,null,null,null,null,null,null,null,null,null,null,null,null,null,null,null,null,null,null,null,null,null,null,null,null,">",null,null,null,null,null,null,null,null,null,null,null,null,null,null,null,null,null,null,null,null,null,null,null,null,null,null,null,null,null,null,null,">",null,null,null,null,null,null,null,null,null,null,null,null,null,null,null,null,null,null,null,null,null,null,null,null,null,null,null,null,null,null,null,">",null,null,null,null,null,null,null,null,null,null,null,null,null,null,null,null,null,null,null,null,null,null,null,null,null,null,null,null,null,null,null,">",null,null,null,null,null,null,null,null,null,null,null,null,null,null,null,null,null,null,null,null,null,null,null,null,null,null,null,null,null,null,null,">",{"$f":"IF(COUNTA(U86:FW86)>5,\"OK\",\"N/E\")","v":"N/E"}]
[null,{"$f":"N87*D87*$N$84","v":0},{"$f":"IF(COUNTA(T87:CD87)<>0,N87,0)","v":0.05},false,null,null,0,0,0,0,null,null,"Les techniques de recherche documentaire sont maîtrisées",0.05,null,null,null,null,null,null,null,null,null,null,null,null,null,null,null,null,null,null,null,null,null,null,null,null,null,null,null,null,null,null,null,null,null,null,null,null,">",null,null,null,null,null,null,null,null,null,null,null,null,null,null,null,null,null,null,null,null,null,null,null,null,null,null,null,null,null,null,null,">",null,null,null,null,null,null,null,null,null,null,null,null,null,null,null,null,null,null,null,null,null,null,null,null,null,null,null,null,null,null,null,">",null,null,null,null,null,null,null,null,null,null,null,null,null,null,null,null,null,null,null,null,null,null,null,null,null,null,null,null,null,null,null,">",null,null,null,null,null,null,null,null,null,null,null,null,null,null,null,null,null,null,null,null,null,null,null,null,null,null,null,null,null,null,null,">",{"$f":"IF(COUNTA(U87:FW87)>5,\"OK\",\"N/E\")","v":"N/E"}]
[null,{"$f":"N88*D88*$N$84","v":0},{"$f":"IF(COUNTA(T88:CD88)<>0,N88,0)","v":0.05},false,null,null,0,0,0,0,null,null,"Les informations conservées sont opportunes",0.05,null,null,null,null,null,null,null,null,null,null,null,null,null,null,null,null,null,null,null,null,null,null,null,null,null,null,null,null,null,null,null,null,null,null,null,null,">",null,null,null,null,null,null,null,null,null,null,null,null,null,null,null,null,null,null,null,null,null,null,null,null,null,null,null,null,null,null,null,">",null,null,null,null,null,null,null,null,null,null,null,null,null,null,null,null,null,null,null,null,null,null,null,null,null,null,null,null,null,null,null,">",null,null,null,null,null,null,null,null,null,null,null,null,null,null,null,null,null,null,null,null,null,null,null,null,null,null,null,null,null,null,null,">",null,null,null,null,null,null,null,null,null,null,null,null,null,null,null,null,null,null,null,null,null,null,null,null,null,null,null,null,null,null,null,">",{"$f":"IF(COUNTA(U88:FW88)>5,\"OK\",\"N/E\")","v":"N/E"}]
[null,{"$f":"N89*D89*$N$84","v":0},{"$f":"IF(COUNTA(T89:CD89)<>0,N89,0)","v":0.1},false,null,null,0,0,0,0,null,null,"Le classement des données permet de les retrouver rapidement",0.1,null,null,null,null,null,null,null,null,null,null,null,null,null,null,null,null,null,null,null,null,null,null,null,null,null,null,null,null,null,null,null,null,null,null,null,null,">",null,null,null,null,null,null,null,null,null,null,null,null,null,null,null,null,null,null,null,null,null,null,null,null,null,null,null,null,null,null,null,">",null,null,null,null,null,null,null,null,null,null,null,null,null,null,null,null,null,null,null,null,null,null,null,null,null,null,null,null,null,null,null,">",null,null,null,null,null,null,null,null,null,null,null,null,null,null,null,null,null,null,null,null,null,null,null,null,null,null,null,null,null,null,null,">",null,null,null,null,null,null,null,null,null,null,null,null,null,null,null,null,null,null,null,null,null,null,null,null,null,null,null,null,null,null,null,">",{"$f":"IF(COUNTA(U89:FW89)>5,\"OK\",\"N/E\")","v":"N/E"}]
[null,null,null,false,null,null,null,null,null,null,null,null,"D2 - Mettre en œuvre une communication : Choisir un support de communication et un média adapté, argumenter, produire un support de communication et adapter sa stratégie de communication au contexte"]
[null,{"$f":"N91*D91*$N$84","v":0},{"$f":"IF(COUNTA(T91:CD91)<>0,N91,0)","v":0.2},false,null,null,0,0,0,0,null,null,"Les outils de communication sont maîtrisés",0.2,null,null,null,null,null,null,null,null,null,null,null,null,null,null,null,null,null,null,null,null,null,null,null,null,null,null,null,null,null,null,null,null,null,null,null,null,">",null,null,null,null,null,null,null,null,null,null,null,null,null,null,null,null,null,null,null,null,null,null,null,null,null,null,null,null,null,null,null,">",null,null,null,null,null,null,null,null,null,null,null,null,null,null,null,null,null,null,null,null,null,null,null,null,null,null,null,null,null,null,null,">",null,null,null,null,null,null,null,null,null,null,null,null,null,null,null,null,null,null,null,null,null,null,null,null,null,null,null,null,null,null,null,">",null,null,null,null,null,null,null,null,null,null,null,null,null,null,null,null,null,null,null,null,null,null,null,null,null,null,null,null,null,null,null,">",{"$f":"IF(COUNTA(U91:FW91)>5,\"OK\",\"N/E\")","v":"N/E"}]
[null,{"$f":"N92*D92*$N$84","v":0},{"$f":"IF(COUNTA(T92:CD92)<>0,N92,0)","v":0.1},false,null,null,0,0,0,0,null,null,"Le support utilisé est adapté",0.1,null,null,null,null,null,null,null,null,null,null,null,null,null,null,null,null,null,null,null,null,null,null,null,null,null,null,null,null,null,null,null,null,null,null,null,null,">",null,null,null,null,null,null,null,null,null,null,null,null,null,null,null,null,null,null,null,null,null,null,null,null,null,null,null,null,null,null,null,">",null,null,null,null,null,null,null,null,null,null,null,null,null,null,null,null,null,null,null,null,null,null,null,null,null,null,null,null,null,null,null,">",null,null,null,null,null,null,null,null,null,null,null,null,null,null,null,null,null,null,null,null,null,null,null,null,null,null,null,null,null,null,null,">",null,null,null,null,null,null,null,null,null,null,null,null,null,null,null,null,null,null,null,null,null,null,null,null,null,null,null,null,null,null,null,">",{"$f":"IF(COUNTA(U92:FW92)>5,\"OK\",\"N/E\")","v":"N/E"}]
[null,{"$f":"N93*D93*$N$84","v":0},{"$f":"IF(COUNTA(T93:CD93)<>0,N93,0)","v":0.2},false,null,null,0,0,0,0,null,null,"La production finale permet la compréhension du problème et de sa résolution ",0.2,null,null,null,null,null,null,null,null,null,null,null,null,null,null,null,null,null,null,null,null,null,null,null,null,null,null,null,null,null,null,null,null,null,null,null,null,">",null,null,null,null,null,null,null,null,null,null,null,null,null,null,null,null,null,null,null,null,null,null,null,null,null,null,null,null,null,null,null,">",null,null,null,null,null,null,null,null,null,null,null,null,null,null,null,null,null,null,null,null,null,null,null,null,null,null,null,null,null,null,null,">",null,null,null,null,null,null,null,null,null,null,null,null,null,null,null,null,null,null,null,null,null,null,null,null,null,null,null,null,null,null,null,">",null,null,null,null,null,null,null,null,null,null,null,null,null,null,null,null,null,null,null,null,null,null,null,null,null,null,null,null,null,null,null,">",{"$f":"IF(COUNTA(U93:FW93)>5,\"OK\",\"N/E\")","v":"N/E"}]
[null,{"$f":"N94*D94*$N$84","v":0},{"$f":"IF(COUNTA(T94:CD94)<>0,N94,0)","v":0.2},false,null,null,0,0,0,0,null,null,"La production respecte le cahier des charges (écrit/oral, texte/vidéo, durée, public visé, …)",0.2,null,null,null,null,null,null,null,null,null,null,null,null,null,null,null,null,null,null,null,null,null,null,null,null,null,null,null,null,null,null,null,null,null,null,null,null,">",null,null,null,null,null,null,null,null,null,null,null,null,null,null,null,null,null,null,null,null,null,null,null,null,null,null,null,null,null,null,null,">",null,null,null,null,null,null,null,null,null,null,null,null,null,null,null,null,null,null,null,null,null,null,null,null,null,null,null,null,null,null,null,">",null,null,null,null,null,null,null,null,null,null,null,null,null,null,null,null,null,null,null,null,null,null,null,null,null,null,null,null,null,null,null,">",null,null,null,null,null,null,null,null,null,null,null,null,null,null,null,null,null,null,null,null,null,null,null,null,null,null,null,null,null,null,null,">",{"$f":"IF(COUNTA(U94:FW94)>5,\"OK\",\"N/E\")","v":"N/E"}]
[null,null,null,{"$f":"IF($B$1>2,TRUE,FALSE)","v":true}]
[null,null,null,{"$f":"IF($B$1>2,TRUE,FALSE)","v":true},null,null,null,null,null,null,null,null,"Evaluation en cours d'année"]
[null,null,null,{"$f":"IF($B$1>2,TRUE,FALSE)","v":true},null,null,null,null,null,null,null,null,"Soutenance finale"]

{"sheet":"Elève D","index":6,"n_rows":97,"n_cols":180,"rows_kept":97,"cut":false,"hidden":false,"merged":[]}
[null,{"$f":"parametres!G5","v":1},null,true,null,null,"IR_t","IR_e","IS_t","IS_e",null,null,{"$f":"CONCATENATE(\"D : \",Synthèse!E24,\" \",Synthèse!F24)","v":"D : D d"},null,null,{"$f":"IF($B$2<>0,H2/G2,\"X\")","v":"X"},{"$f":"IF($B$2<>0,J2/I2,\"X\")","v":"X"},{"$f":"IF($B$2<>0,(H2+J2)/(G2+I2),0)","v":0},null,{"$f":"TRANSPOSE('Déclinaison projet'!X10:X170)","v":""},"","","","","","","","","","","","","","","","","","","","","","","","","","","","","","","","","","","","","","","","","","","","","","","","","","","","","","","","","","","","","","","REVUE DE PROJET - Conception préliminaire","","","","","","","","","","","","","","","","","","","","","","","","","","","","","","","","REVUE DE PROJET - Conception détaillée","","","","","","","","","","","","","","","","","","","","","","","","","","","","","","","","REVUE DE PROJET - Réalisation","","","","","","","","","","","","","","","","","","","","","","","","","","","","","","","","REVUE DE PROJET - Validation","SOUTENANCE FINALE DU PROJET"]
[null,{"$f":"SUM(B4:B94)","v":0},null,true,null,null,{"$f":"SUM(G4:G94)","v":0},{"$f":"SUM(H4:H94)","v":0},{"$f":"SUM(I4:I94)","v":0},{"$f":"SUM(J4:J94)","v":0},null,null,null,null,null,"Tx Indic. REVUES","Tx Indic. SOUTEN.","Taux Global"]
[]
[null,null,null,{"$f":"IF($B$1>2,TRUE,FALSE)","v":false},null,null,null,null,null,null,null,null,"O1 -  Caractériser des systèmes privilégiant un usage raisonné du point de vue développement durable"]
[null,{"$f":"N5*D5","v":0},{"$f":"IF(FX5=\"OK\",N5,0)","v":0},false,null,null,{"$f":"IF($FX5=\"\",$B5,0)","v":0},{"$f":"IF(OR($AY5=\"OK\",$CE5=\"OK\",$DK5=\"OK\",$EQ5=\"OK\",$FW5=\"OK\"),$B5,0)","v":0},{"$f":"IF($FX5=\"\",0,$B5)","v":0},{"$f":"IF($FX5=\"OK\",$B5,0)","v":0},null,null,"CO1.1. Justifier les choix des matériaux, des structures d’un système et les énergies mises en oeuvre dans une approche de développement durable",5,null,null,null,null,null,null,null,null,null,null,null,null,null,null,null,null,null,null,null,null,null,null,null,null,null,null,null,null,null,null,null,null,null,null,null,null,">",null,null,null,null,null,null,null,null,null,null,null,null,null,null,null,null,null,null,null,null,null,null,null,null,null,null,null,null,null,null,null,">",null,null,null,null,null,null,null,null,null,null,null,null,null,null,null,null,null,null,null,null,null,null,null,null,null,null,null,null,null,null,null,">",null,null,null,null,null,null,null,null,null,null,null,null,null,null,null,null,null,null,null,null,null,null,null,null,null,null,null,null,null,null,null,">",null,null,null,null,null,null,null,null,null,null,null,null,null,null,null,null,null,null,null,null,null,null,null,null,null,null,null,null,null,null,null,">",{"$f":"IF(COUNTA(U5:FW5)>5,\"OK\",\"N/E\")","v":"N/E"}]
[null,0,{"$f":"IF(FX6=\"OK\",N6,0)","v":0},false,null,null,{"$f":"IF($FX6=\"\",$B6,0)","v":0},{"$f":"IF(OR($AY6=\"OK\",$CE6=\"OK\",$DK6=\"OK\",$EQ6=\"OK\",$FW6=\"OK\"),$B6,0)","v":0},{"$f":"IF($FX6=\"\",0,$B6)","v":0},{"$f":"IF($FX6=\"OK\",$B6,0)","v":0},null,null,"CO1.2. Justifier le choix d’une solution selon des contraintes d’ergonomie et d’effets sur la santé de l’homme et du vivant",3,null,null,null,null,null,null,null,null,null,null,null,null,null,null,null,null,null,null,null,null,null,null,null,null,null,null,null,null,null,null,null,null,null,null,null,null,">",null,null,null,null,null,null,null,null,null,null,null,null,null,null,null,null,null,null,null,null,null,null,null,null,null,null,null,null,null,null,null,">",null,null,null,null,null,null,null,null,null,null,null,null,null,null,null,null,null,null,null,null,null,null,null,null,null,null,null,null,null,null,null,">",null,null,null,null,null,null,null,null,null,null,null,null,null,null,null,null,null,null,null,null,null,null,null,null,null,null,null,null,null,null,null,">",null,null,null,null,null,null,null,null,null,null,null,null,null,null,null,null,null,null,null,null,null,null,null,null,null,null,null,null,null,null,null,">",{"$f":"IF(COUNTA(U6:FW6)>5,\"OK\",\"N/E\")","v":"N/E"}]
[null,null,null,false,null,null,null,null,null,null,null,null,"O2 - Identifier les éléments permettant la limitation de l’Impact environnemental d’un système et de ses constituants"]
[null,0,{"$f":"IF(FX8=\"OK\",N8,0)","v":0},false,null,null,0,0,0,0,null,null,"CO2.1. Identifier les flux et la forme de l’énergie, caractériser ses transformations et/ou modulations et estimer l’efficacité énergétique globale d’un système",4,null,null,null,null,null,null,null,null,null,null,null,null,null,null,null,null,null,null,null,null,null,null,null,null,null,null,null,null,null,null,null,null,null,null,null,null,">",null,null,null,null,null,null,null,null,null,null,null,null,null,null,null,null,null,null,null,null,null,null,null,null,null,null,null,null,null,null,null,">",null,null,null,null,null,null,null,null,null,null,null,null,null,null,null,null,null,null,null,null,null,null,null,null,null,null,null,null,null,null,null,">",null,null,null,null,null,null,null,null,null,null,null,null,null,null,null,null,null,null,null,null,null,null,null,null,null,null,null,null,null,null,null,">",null,null,null,null,null,null,null,null,null,null,null,null,null,null,null,null,null,null,null,null,null,null,null,null,null,null,null,null,null,null,null,">",{"$f":"IF(COUNTA(U8:FW8)>5,\"OK\",\"N/E\")","v":"N/E"}]
[null,0,{"$f":"IF(FX9=\"OK\",N9,0)","v":0},false,null,null,0,0,0,0,null,null,"CO2.2. Justifier les solutions constructives d’un système au regard des impacts environnementaux et économiques engendrés tout au long de son cycle de vie",5,null,null,null,null,null,null,null,null,null,null,null,null,null,null,null,null,null,null,null,null,null,null,null,null,null,null,null,null,null,null,null,null,null,null,null,null,">",null,null,null,null,null,null,null,null,null,null,null,null,null,null,null,null,null,null,null,null,null,null,null,null,null,null,null,null,null,null,null,">",null,null,null,null,null,null,null,null,null,null,null,null,null,null,null,null,null,null,null,null,null,null,null,null,null,null,null,null,null,null,null,">",null,null,null,null,null,null,null,null,null,null,null,null,null,null,null,null,null,null,null,null,null,null,null,null,null,null,null,null,null,null,null,">",null,null,null,null,null,null,null,null,null,null,null,null,null,null,null,null,null,null,null,null,null,null,null,null,null,null,null,null,null,null,null,">",{"$f":"IF(COUNTA(U9:FW9)>5,\"OK\",\"N/E\")","v":"N/E"}]
[null,null,null,false,null,null,null,null,null,null,null,null,"O6 - Communiquer une idée, un principe ou une solution technique, un projet, y compris en langue étrangère"]
[null,0,{"$f":"IF(FX11=\"OK\",N11,0)","v":0},false,null,null,0,0,0,0,null,null,"CO6.1. Décrire une idée, un principe, une solution, un projet en utilisant des outils de représentation adaptés",3,null,null,null,null,null,null,null,null,null,null,null,null,null,null,null,null,null,null,null,null,null,null,null,null,null,null,null,null,null,null,null,null,null,null,null,null,">",null,null,null,null,null,null,null,null,null,null,null,null,null,null,null,null,null,null,null,null,null,null,null,null,null,null,null,null,null,null,null,">",null,null,null,null,null,null,null,null,null,null,null,null,null,null,null,null,null,null,null,null,null,null,null,null,null,null,null,null,null,null,null,">",null,null,null,null,null,null,null,null,null,null,null,null,null,null,null,null,null,null,null,null,null,null,null,null,null,null,null,null,null,null,null,">",null,null,null,null,null,null,null,null,null,null,null,null,null,null,null,null,null,null,null,null,null,null,null,null,null,null,null,null,null,null,null,">",{"$f":"IF(COUNTA(U11:FW11)>5,\"OK\",\"N/E\")","v":"N/E"}]
[null,0,{"$f":"IF(FX12=\"OK\",N12,0)","v":0},false,null,null,0,0,0,0,null,null,"CO6.2. Décrire le fonctionnement et/ou l’exploitation d’un système en utilisant l'outil de description le plus pertinent",3,null,null,null,null,null,null,null,null,null,null,null,null,null,null,null,null,null,null,null,null,null,null,null,null,null,null,null,null,null,null,null,null,null,null,null,null,">",null,null,null,null,null,null,null,null,null,null,null,null,null,null,null,null,null,null,null,null,null,null,null,null,null,null,null,null,null,null,null,">",null,null,null,null,null,null,null,null,null,null,null,null,null,null,null,null,null,null,null,null,null,null,null,null,null,null,null,null,null,null,null,">",null,null,null,null,null,null,null,null,null,null,null,null,null,null,null,null,null,null,null,null,null,null,null,null,null,null,null,null,null,null,null,">",null,null,null,null,null,null,null,null,null,null,null,null,null,null,null,null,null,null,null,null,null,null,null,null,null,null,null,null,null,null,null,">",{"$f":"IF(COUNTA(U12:FW12)>5,\"OK\",\"N/E\")","v":"N/E"}]
[null,0,{"$f":"IF(FX13=\"OK\",N13,0)","v":0},false,null,null,0,0,0,0,null,null,"CO6.3. Présenter et argumenter des démarches, des résultats, y compris dans une langue étrangère",5,null,null,null,null,null,null,null,null,null,null,null,null,null,null,null,null,null,null,null,null,null,null,null,null,null,null,null,null,null,null,null,null,null,null,null,null,">",null,null,null,null,null,null,null,null,null,null,null,null,null,null,null,null,null,null,null,null,null,null,null,null,null,null,null,null,null,null,null,">",null,null,null,null,null,null,null,null,null,null,null,null,null,null,null,null,null,null,null,null,null,null,null,null,null,null,null,null,null,null,null,">",null,null,null,null,null,null,null,null,null,null,null,null,null,null,null,null,null,null,null,null,null,null,null,null,null,null,null,null,null,null,null,">",null,null,null,null,null,null,null,null,null,null,null,null,null,null,null,null,null,null,null,null,null,null,null,null,null,null,null,null,null,null,null,">",{"$f":"IF(COUNTA(U13:FW13)>5,\"OK\",\"N/E\")","v":"N/E"}]
[null,null,null,false,null,null,null,null,null,null,null,null,"O7 -  Imaginer une solution, répondre à un besoin"]
[null,0,{"$f":"IF(OR(CE15=\"OK\",EQ15=\"OK\"),N15,0)","v":0},{"$f":"IF($B$1=3,TRUE,FALSE)","v":false},null,null,0,0,0,0,null,null,"CO7.ac1. Participer à une étude architecturale, dans une démarche de développement durable",5,null,null,null,null,null,null,null,null,null,null,null,null,null,null,null,null,null,null,null,null,null,null,null,null,null,null,null,null,null,null,null,null,null,null,null,null,{"$f":"IF(AND(AY$1<>\"\",COUNTA(U15:AX15)>0),\"OK\",\"N/E\")","v":"N/E"},null,null,null,null,null,null,null,null,null,null,null,null,null,null,null,null,null,null,null,null,null,null,null,null,null,null,null,null,null,null,null,{"$f":"IF(AND(CE$1<>\"\",COUNTA(U15:CD15)>1),\"OK\",\"N/E\")","v":"N/E"},null,null,null,null,null,null,null,null,null,null,null,null,null,null,null,null,null,null,null,null,null,null,null,null,null,null,null,null,null,null,null,{"$f":"IF(AND(DK$1<>\"\",COUNTA(U15:DJ15)>2),\"OK\",\"N/E\")","v":"N/E"},null,null,null,null,null,null,null,null,null,null,null,null,null,null,null,null,null,null,null,null,null,null,null,null,null,null,null,null,null,null,null,{"$f":"IF(AND(EQ$1<>\"\",COUNTA(U15:EP15)>3),\"OK\",\"N/E\")","v":"N/E"},null,null,null,null,null,null,null,null,null,null,null,null,null,null,null,null,null,null,null,null,null,null,null,null,null,null,null,null,null,null,null,{"$f":"IF(AND(FW$1<>\"\",COUNTA(U15:FV15)>4),\"OK\",\"N/E\")","v":"N/E"}]
[null,0,0,{"$f":"IF($B$1=3,TRUE,FALSE)","v":false},null,null,0,0,0,0,null,null,"CO7.ac2. Proposer/choisir des solutions techniques répondant aux contraintes et attentes d’une construction",7,null,null,null,null,null,null,null,null,null,null,null,null,null,null,null,null,null,null,null,null,null,null,null,null,null,null,null,null,null,null,null,null,null,null,null,null,{"$f":"IF(AND(AY$1<>\"\",COUNTA(U16:AX16)>0),\"OK\",\"N/E\")","v":"N/E"},null,null,null,null,null,null,null,null,null,null,null,null,null,null,null,null,null,null,null,null,null,null,null,null,null,null,null,null,null,null,null,{"$f":"IF(AND(CE$1<>\"\",COUNTA(U16:CD16)>1),\"OK\",\"N/E\")","v":"N/E"},null,null,null,null,null,null,null,null,null,null,null,null,null,null,null,null,null,null,null,null,null,null,null,null,null,null,null,null,null,null,null,{"$f":"IF(AND(DK$1<>\"\",COUNTA(U16:DJ16)>2),\"OK\",\"N/E\")","v":"N/E"},null,null,null,null,null,null,null,null,null,null,null,null,null,null,null,null,null,null,null,null,null,null,null,null,null,null,null,null,null,null,null,{"$f":"IF(AND(EQ$1<>\"\",COUNTA(U16:EP16)>3),\"OK\",\"N/E\")","v":"N/E"},null,null,null,null,null,null,null,null,null,null,null,null,null,null,null,null,null,null,null,null,null,null,null,null,null,null,null,null,null,null,null,{"$f":"IF(AND(FW$1<>\"\",COUNTA(U16:FV16)>4),\"OK\",\"N/E\")","v":"N/E"}]
[null,0,0,{"$f":"IF($B$1=3,TRUE,FALSE)","v":false},null,null,0,0,0,0,null,null,"CO7.ac3. Concevoir une organisation de réalisation",4,null,null,null,null,null,null,null,null,null,null,null,null,null,null,null,null,null,null,null,null,null,null,null,null,null,null,null,null,null,null,null,null,null,null,null,null,"N/E",null,null,null,null,null,null,null,null,null,null,null,null,null,null,null,null,null,null,null,null,null,null,null,null,null,null,null,null,null,null,null,"N/E",null,null,null,null,null,null,null,null,null,null,null,null,null,null,null,null,null,null,null,null,null,null,null,null,null,null,null,null,null,null,null,"N/E",null,null,null,null,null,null,null,null,null,null,null,null,null,null,null,null,null,null,null,null,null,null,null,null,null,null,null,null,null,null,null,"N/E",null,null,null,null,null,null,null,null,null,null,null,null,null,null,null,null,null,null,null,null,null,null,null,null,null,null,null,null,null,null,null,"N/E"]
[null,0,0,{"$f":"IF($B$1=4,TRUE,FALSE)","v":false},null,null,0,0,0,0,null,null,"CO7.ee1. Participer à une démarche de conception dans le but de proposer plusieurs solutions possibles à un problème technique identifié en lien avec un enjeu énergétique",7,null,null,null,null,null,null,null,null,null,null,null,null,null,null,null,null,null,null,null,null,null,null,null,null,null,null,null,null,null,null,null,null,null,null,null,null,"N/E",null,null,null,null,null,null,null,null,null,null,null,null,null,null,null,null,null,null,null,null,null,null,null,null,null,null,null,null,null,null,null,"N/E",null,null,null,null,null,null,null,null,null,null,null,null,null,null,null,null,null,null,null,null,null,null,null,null,null,null,null,null,null,null,null,"N/E",null,null,null,null,null,null,null,null,null,null,null,null,null,null,null,null,null,null,null,null,null,null,null,null,null,null,null,null,null,null,null,"N/E",null,null,null,null,null,null,null,null,null,null,null,null,null,null,null,null,null,null,null,null,null,null,null,null,null,null,null,null,null,null,null,"N/E"]
[null,0,0,{"$f":"IF($B$1=4,TRUE,FALSE)","v":false},null,null,0,0,0,0,null,null,"CO7.ee2. Justifier une solution retenue en intégrant les conséquences des choix sur le triptyque matériau-énergie-information",6,null,null,null,null,null,null,null,null,null,null,null,null,null,null,null,null,null,null,null,null,null,null,null,null,null,null,null,null,null,null,null,null,null,null,null,null,"N/E",null,null,null,null,null,null,null,null,null,null,null,null,null,null,null,null,null,null,null,null,null,null,null,null,null,null,null,null,null,null,null,"N/E",null,null,null,null,null,null,null,null,null,null,null,null,null,null,null,null,null,null,null,null,null,null,null,null,null,null,null,null,null,null,null,"N/E",null,null,null,null,null,null,null,null,null,null,null,null,null,null,null,null,null,null,null,null,null,null,null,null,null,null,null,null,null,null,null,"N/E",null,null,null,null,null,null,null,null,null,null,null,null,null,null,null,null,null,null,null,null,null,null,null,null,null,null,null,null,null,null,null,"N/E"]
[null,0,0,{"$f":"IF($B$1=4,TRUE,FALSE)","v":false},null,null,0,0,0,0,null,null,"CO7.ee3. Définir la structure, la constitution d’un système en fonction des caractéristiques technico-économiques et environnementales attendues",4,null,null,null,null,null,null,null,null,null,null,null,null,null,null,null,null,null,null,null,null,null,null,null,null,null,null,null,null,null,null,null,null,null,null,null,null,"N/E",null,null,null,null,null,null,null,null,null,null,null,null,null,null,null,null,null,null,null,null,null,null,null,null,null,null,null,null,null,null,null,"N/E",null,null,null,null,null,null,null,null,null,null,null,null,null,null,null,null,null,null,null,null,null,null,null,null,null,null,null,null,null,null,null,"N/E",null,null,null,null,null,null,null,null,null,null,null,null,null,null,null,null,null,null,null,null,null,null,null,null,null,null,null,null,null,null,null,"N/E",null,null,null,null,null,null,null,null,null,null,null,null,null,null,null,null,null,null,null,null,null,null,null,null,null,null,null,null,null,null,null,"N/E"]
[null,0,0,{"$f":"IF($B$1=4,TRUE,FALSE)","v":false},null,null,0,0,0,0,null,null,"CO7.ee4. Définir les modifications de la structure, les choix de constituants et du type de système de gestion d'une chaîne d’énergie afin de répondre à une évolution d’un cahier des charges",4,null,null,null,null,null,null,null,null,null,null,null,null,null,null,null,null,null,null,null,null,null,null,null,null,null,null,null,null,null,null,null,null,null,null,null,null,"N/E",null,null,null,null,null,null,null,null,null,null,null,null,null,null,null,null,null,null,null,null,null,null,null,null,null,null,null,null,null,null,null,"N/E",null,null,null,null,null,null,null,null,null,null,null,null,null,null,null,null,null,null,null,null,null,null,null,null,null,null,null,null,null,null,null,"N/E",null,null,null,null,null,null,null,null,null,null,null,null,null,null,null,null,null,null,null,null,null,null,null,null,null,null,null,null,null,null,null,"N/E",null,null,null,null,null,null,null,null,null,null,null,null,null,null,null,null,null,null,null,null,null,null,null,null,null,null,null,null,null,null,null,"N/E"]
[null,0,0,{"$f":"IF($B$1=5,TRUE,FALSE)","v":false},null,null,0,0,0,0,null,null,"CO7.itec1. Identifier et justifier un problème technique à partir de l’analyse globale d’un système (approche matière-énergie-information)",5,null,null,null,null,null,null,null,null,null,null,null,null,null,null,null,null,null,null,null,null,null,null,null,null,null,null,null,null,null,null,null,null,null,null,null,null,"N/E",null,null,null,null,null,null,null,null,null,null,null,null,null,null,null,null,null,null,null,null,null,null,null,null,null,null,null,null,null,null,null,"N/E",null,null,null,null,null,null,null,null,null,null,null,null,null,null,null,null,null,null,null,null,null,null,null,null,null,null,null,null,null,null,null,"N/E",null,null,null,null,null,null,null,null,null,null,null,null,null,null,null,null,null,null,null,null,null,null,null,null,null,null,null,null,null,null,null,"N/E",null,null,null,null,null,null,null,null,null,null,null,null,null,null,null,null,null,null,null,null,null,null,null,null,null,null,null,null,null,null,null,"N/E"]
[null,0,0,{"$f":"IF($B$1=5,TRUE,FALSE)","v":false},null,null,0,0,0,0,null,null,"CO7.itec2. Proposer des solutions à un problème technique identifié en participant à des démarches de créativité, choisir et justifier la solution retenue",6,null,null,null,null,null,null,null,null,null,null,null,null,null,null,null,null,null,null,null,null,null,null,null,null,null,null,null,null,null,null,null,null,null,null,null,null,"N/E",null,null,null,null,null,null,null,null,null,null,null,null,null,null,null,null,null,null,null,null,null,null,null,null,null,null,null,null,null,null,null,"N/E",null,null,null,null,null,null,null,null,null,null,null,null,null,null,null,null,null,null,null,null,null,null,null,null,null,null,null,null,null,null,null,"N/E",null,null,null,null,null,null,null,null,null,null,null,null,null,null,null,null,null,null,null,null,null,null,null,null,null,null,null,null,null,null,null,"N/E",null,null,null,null,null,null,null,null,null,null,null,null,null,null,null,null,null,null,null,null,null,null,null,null,null,null,null,null,null,null,null,"N/E"]
[null,0,0,{"$f":"IF($B$1=5,TRUE,FALSE)","v":false},null,null,0,0,0,0,null,null,"CO7.itec3. Définir, à l’aide d’un modeleur numérique, les formes et dimensions d'une pièce d'un mécanisme à partir des contraintes fonctionnelles, de son principe de réalisation et de son matériau",3,null,null,null,null,null,null,null,null,null,null,null,null,null,null,null,null,null,null,null,null,null,null,null,null,null,null,null,null,null,null,null,null,null,null,null,null,"N/E",null,null,null,null,null,null,null,null,null,null,null,null,null,null,null,null,null,null,null,null,null,null,null,null,null,null,null,null,null,null,null,"N/E",null,null,null,null,null,null,null,null,null,null,null,null,null,null,null,null,null,null,null,null,null,null,null,null,null,null,null,null,null,null,null,"N/E",null,null,null,null,null,null,null,null,null,null,null,null,null,null,null,null,null,null,null,null,null,null,null,null,null,null,null,null,null,null,null,"N/E",null,null,null,null,null,null,null,null,null,null,null,null,null,null,null,null,null,null,null,null,null,null,null,null,null,null,null,null,null,null,null,"N/E"]
[null,0,0,{"$f":"IF($B$1=5,TRUE,FALSE)","v":false},null,null,0,0,0,0,null,null,"CO7.itec4. Définir, à l’aide d’un modeleur numérique, les modifications d'un mécanisme à partir des contraintes fonctionnelles",2,null,null,null,null,null,null,null,null,null,null,null,null,null,null,null,null,null,null,null,null,null,null,null,null,null,null,null,null,null,null,null,null,null,null,null,null,"N/E",null,null,null,null,null,null,null,null,null,null,null,null,null,null,null,null,null,null,null,null,null,null,null,null,null,null,null,null,null,null,null,"N/E",null,null,null,null,null,null,null,null,null,null,null,null,null,null,null,null,null,null,null,null,null,null,null,null,null,null,null,null,null,null,null,"N/E",null,null,null,null,null,null,null,null,null,null,null,null,null,null,null,null,null,null,null,null,null,null,null,null,null,null,null,null,null,null,null,"N/E",null,null,null,null,null,null,null,null,null,null,null,null,null,null,null,null,null,null,null,null,null,null,null,null,null,null,null,null,null,null,null,"N/E"]
[null,0,0,{"$f":"IF($B$1=6,TRUE,FALSE)","v":false},null,null,0,0,0,0,null,null,"CO7.sin1. Décoder la notice technique d’un système, vérifier la conformité du fonctionnement",4,null,null,null,null,null,null,null,null,null,null,null,null,null,null,null,null,null,null,null,null,null,null,null,null,null,null,null,null,null,null,null,null,null,null,null,null,"N/E",null,null,null,null,null,null,null,null,null,null,null,null,null,null,null,null,null,null,null,null,null,null,null,null,null,null,null,null,null,null,null,"N/E",null,null,null,null,null,null,null,null,null,null,null,null,null,null,null,null,null,null,null,null,null,null,null,null,null,null,null,null,null,null,null,"N/E",null,null,null,null,null,null,null,null,null,null,null,null,null,null,null,null,null,null,null,null,null,null,null,null,null,null,null,null,null,null,null,"N/E",null,null,null,null,null,null,null,null,null,null,null,null,null,null,null,null,null,null,null,null,null,null,null,null,null,null,null,null,null,null,null,"N/E"]
[null,0,0,{"$f":"IF($B$1=6,TRUE,FALSE)","v":false},null,null,0,0,0,0,null,null,"CO7.sin2. Décoder le cahier des charges fonctionnel décrivant le besoin exprimé, identifier la fonction définie par un besoin exprimé, faire des mesures pour caractériser cette fonction et conclure sur sa conformité",5,null,null,null,null,null,null,null,null,null,null,null,null,null,null,null,null,null,null,null,null,null,null,null,null,null,null,null,null,null,null,null,null,null,null,null,null,"N/E",null,null,null,null,null,null,null,null,null,null,null,null,null,null,null,null,null,null,null,null,null,null,null,null,null,null,null,null,null,null,null,"N/E",null,null,null,null,null,null,null,null,null,null,null,null,null,null,null,null,null,null,null,null,null,null,null,null,null,null,null,null,null,null,null,"N/E",null,null,null,null,null,null,null,null,null,null,null,null,null,null,null,null,null,null,null,null,null,null,null,null,null,null,null,null,null,null,null,"N/E",null,null,null,null,null,null,null,null,null,null,null,null,null,null,null,null,null,null,null,null,null,null,null,null,null,null,null,null,null,null,null,"N/E"]
[null,0,0,{"$f":"IF($B$1=6,TRUE,FALSE)","v":false},null,null,0,0,0,0,null,null,"CO7.sin3. Exprimer le principe de fonctionnement d’un système à partir des diagrammes SysML pertinents Repérer les constituants de la chaîne d’énergie et d’information",4,null,null,null,null,null,null,null,null,null,null,null,null,null,null,null,null,null,null,null,null,null,null,null,null,null,null,null,null,null,null,null,null,null,null,null,null,"N/E",null,null,null,null,null,null,null,null,null,null,null,null,null,null,null,null,null,null,null,null,null,null,null,null,null,null,null,null,null,null,null,"N/E",null,null,null,null,null,null,null,null,null,null,null,null,null,null,null,null,null,null,null,null,null,null,null,null,null,null,null,null,null,null,null,"N/E",null,null,null,null,null,null,null,null,null,null,null,null,null,null,null,null,null,null,null,null,null,null,null,null,null,null,null,null,null,null,null,"N/E",null,null,null,null,null,null,null,null,null,null,null,null,null,null,null,null,null,null,null,null,null,null,null,null,null,null,null,null,null,null,null,"N/E"]
[null,null,null,{"$f":"IF($B$1>2,TRUE,FALSE)","v":false},null,null,null,null,null,null,null,null,"O8 -Valider des solutions techniques"]
[null,0,{"$f":"IF(OR(CE30=\"OK\",EQ30=\"OK\"),N30,0)","v":0},{"$f":"IF($B$1=3,TRUE,FALSE)","v":false},null,null,0,0,0,0,null,null,"CO8.ac1. Simuler un comportement structurel, thermique et acoustique de tout ou partie d’une construction",4,null,null,null,null,null,null,null,null,null,null,null,null,null,null,null,null,null,null,null,null,null,null,null,null,null,null,null,null,null,null,null,null,null,null,null,null,{"$f":"IF(AND(AY$1<>\"\",COUNTA(U30:AX30)>0),\"OK\",\"N/E\")","v":"N/E"},null,null,null,null,null,null,null,null,null,null,null,null,null,null,null,null,null,null,null,null,null,null,null,null,null,null,null,null,null,null,null,{"$f":"IF(AND(CE$1<>\"\",COUNTA(U30:CD30)>1),\"OK\",\"N/E\")","v":"N/E"},null,null,null,null,null,null,null,null,null,null,null,null,null,null,null,null,null,null,null,null,null,null,null,null,null,null,null,null,null,null,null,{"$f":"IF(AND(DK$1<>\"\",COUNTA(U30:DJ30)>2),\"OK\",\"N/E\")","v":"N/E"},null,null,null,null,null,null,null,null,null,null,null,null,null,null,null,null,null,null,null,null,null,null,null,null,null,null,null,null,null,null,null,{"$f":"IF(AND(EQ$1<>\"\",COUNTA(U30:EP30)>3),\"OK\",\"N/E\")","v":"N/E"},null,null,null,null,null,null,null,null,null,null,null,null,null,null,null,null,null,null,null,null,null,null,null,null,null,null,null,null,null,null,null,{"$f":"IF(AND(FW$1<>\"\",COUNTA(U30:FV30)>4),\"OK\",\"N/E\")","v":"N/E"}]
[null,0,0,{"$f":"IF($B$1=3,TRUE,FALSE)","v":false},null,null,0,0,0,0,null,null,"CO8.ac2. Analyser les résultats issus de simulations ou d’essais de laboratoire",4,null,null,null,null,null,null,null,null,null,null,null,null,null,null,null,null,null,null,null,null,null,null,null,null,null,null,null,null,null,null,null,null,null,null,null,null,"N/E",null,null,null,null,null,null,null,null,null,null,null,null,null,null,null,null,null,null,null,null,null,null,null,null,null,null,null,null,null,null,null,"N/E",null,null,null,null,null,null,null,null,null,null,null,null,null,null,null,null,null,null,null,null,null,null,null,null,null,null,null,null,null,null,null,"N/E",null,null,null,null,null,null,null,null,null,null,null,null,null,null,null,null,null,null,null,null,null,null,null,null,null,null,null,null,null,null,null,"N/E",null,null,null,null,null,null,null,null,null,null,null,null,null,null,null,null,null,null,null,null,null,null,null,null,null,null,null,null,null,null,null,"N/E"]
[null,0,0,{"$f":"IF($B$1=3,TRUE,FALSE)","v":false},null,null,0,0,0,0,null,null,"CO8.ac3. Analyser/valider les choix structurels et de confort",4,null,null,null,null,null,null,null,null,null,null,null,null,null,null,null,null,null,null,null,null,null,null,null,null,null,null,null,null,null,null,null,null,null,null,null,null,"N/E",null,null,null,null,null,null,null,null,null,null,null,null,null,null,null,null,null,null,null,null,null,null,null,null,null,null,null,null,null,null,null,"N/E",null,null,null,null,null,null,null,null,null,null,null,null,null,null,null,null,null,null,null,null,null,null,null,null,null,null,null,null,null,null,null,"N/E",null,null,null,null,null,null,null,null,null,null,null,null,null,null,null,null,null,null,null,null,null,null,null,null,null,null,null,null,null,null,null,"N/E",null,null,null,null,null,null,null,null,null,null,null,null,null,null,null,null,null,null,null,null,null,null,null,null,null,null,null,null,null,null,null,"N/E"]
[null,0,0,{"$f":"IF($B$1=4,TRUE,FALSE)","v":false},null,null,0,0,0,0,null,null,"CO8.ee1. Renseigner un logiciel de simulation du comportement énergétique avec les caractéristiques du système et les paramètres externes pour un point de fonctionnement donné",3,null,null,null,null,null,null,null,null,null,null,null,null,null,null,null,null,null,null,null,null,null,null,null,null,null,null,null,null,null,null,null,null,null,null,null,null,"N/E",null,null,null,null,null,null,null,null,null,null,null,null,null,null,null,null,null,null,null,null,null,null,null,null,null,null,null,null,null,null,null,"N/E",null,null,null,null,null,null,null,null,null,null,null,null,null,null,null,null,null,null,null,null,null,null,null,null,null,null,null,null,null,null,null,"N/E",null,null,null,null,null,null,null,null,null,null,null,null,null,null,null,null,null,null,null,null,null,null,null,null,null,null,null,null,null,null,null,"N/E",null,null,null,null,null,null,null,null,null,null,null,null,null,null,null,null,null,null,null,null,null,null,null,null,null,null,null,null,null,null,null,"N/E"]
[null,0,0,{"$f":"IF($B$1=4,TRUE,FALSE)","v":false},null,null,0,0,0,0,null,null,"CO8.ee2. Interpréter les résultats d'une simulation afin de valider une solution ou l’optimiser",4,null,null,null,null,null,null,null,null,null,null,null,null,null,null,null,null,null,null,null,null,null,null,null,null,null,null,null,null,null,null,null,null,null,null,null,null,"N/E",null,null,null,null,null,null,null,null,null,null,null,null,null,null,null,null,null,null,null,null,null,null,null,null,null,null,null,null,null,null,null,"N/E",null,null,null,null,null,null,null,null,null,null,null,null,null,null,null,null,null,null,null,null,null,null,null,null,null,null,null,null,null,null,null,"N/E",null,null,null,null,null,null,null,null,null,null,null,null,null,null,null,null,null,null,null,null,null,null,null,null,null,null,null,null,null,null,null,"N/E",null,null,null,null,null,null,null,null,null,null,null,null,null,null,null,null,null,null,null,null,null,null,null,null,null,null,null,null,null,null,null,"N/E"]
[null,0,0,{"$f":"IF($B$1=4,TRUE,FALSE)","v":false},null,null,0,0,0,0,null,null,"CO8.ee3. Comparer et interpréter le résultat d'une simulation d'un comportement d’un système avec un comportement réel",3,null,null,null,null,null,null,null,null,null,null,null,null,null,null,null,null,null,null,null,null,null,null,null,null,null,null,null,null,null,null,null,null,null,null,null,null,"N/E",null,null,null,null,null,null,null,null,null,null,null,null,null,null,null,null,null,null,null,null,null,null,null,null,null,null,null,null,null,null,null,"N/E",null,null,null,null,null,null,null,null,null,null,null,null,null,null,null,null,null,null,null,null,null,null,null,null,null,null,null,null,null,null,null,"N/E",null,null,null,null,null,null,null,null,null,null,null,null,null,null,null,null,null,null,null,null,null,null,null,null,null,null,null,null,null,null,null,"N/E",null,null,null,null,null,null,null,null,null,null,null,null,null,null,null,null,null,null,null,null,null,null,null,null,null,null,null,null,null,null,null,"N/E"]
[null,0,0,{"$f":"IF($B$1=4,TRUE,FALSE)","v":false},null,null,0,0,0,0,null,null,"CO8.ee4. Mettre en oeuvre un protocole d’essais et de mesures sur le prototype d’une chaîne d’énergie, interpréter les résultats",5,null,null,null,null,null,null,null,null,null,null,null,null,null,null,null,null,null,null,null,null,null,null,null,null,null,null,null,null,null,null,null,null,null,null,null,null,"N/E",null,null,null,null,null,null,null,null,null,null,null,null,null,null,null,null,null,null,null,null,null,null,null,null,null,null,null,null,null,null,null,"N/E",null,null,null,null,null,null,null,null,null,null,null,null,null,null,null,null,null,null,null,null,null,null,null,null,null,null,null,null,null,null,null,"N/E",null,null,null,null,null,null,null,null,null,null,null,null,null,null,null,null,null,null,null,null,null,null,null,null,null,null,null,null,null,null,null,"N/E",null,null,null,null,null,null,null,null,null,null,null,null,null,null,null,null,null,null,null,null,null,null,null,null,null,null,null,null,null,null,null,"N/E"]
[null,0,0,{"$f":"IF($B$1=5,TRUE,FALSE)","v":false},null,null,0,0,0,0,null,null,"CO8.itec1. Paramétrer un logiciel de simulation mécanique pour obtenir les caractéristiques d'une loi d'entrée/sortie d'un mécanisme simple",3,null,null,null,null,null,null,null,null,null,null,null,null,null,null,null,null,null,null,null,null,null,null,null,null,null,null,null,null,null,null,null,null,null,null,null,null,"N/E",null,null,null,null,null,null,null,null,null,null,null,null,null,null,null,null,null,null,null,null,null,null,null,null,null,null,null,null,null,null,null,"N/E",null,null,null,null,null,null,null,null,null,null,null,null,null,null,null,null,null,null,null,null,null,null,null,null,null,null,null,null,null,null,null,"N/E",null,null,null,null,null,null,null,null,null,null,null,null,null,null,null,null,null,null,null,null,null,null,null,null,null,null,null,null,null,null,null,"N/E",null,null,null,null,null,null,null,null,null,null,null,null,null,null,null,null,null,null,null,null,null,null,null,null,null,null,null,null,null,null,null,"N/E"]
[null,0,0,{"$f":"IF($B$1=5,TRUE,FALSE)","v":false},null,null,0,0,0,0,null,null,"CO8.itec2. Interpréter les résultats d'une simulation mécanique pour valider une solution ou modifier une pièce ou un mécanisme",4,null,null,null,null,null,null,null,null,null,null,null,null,null,null,null,null,null,null,null,null,null,null,null,null,null,null,null,null,null,null,null,null,null,null,null,null,"N/E",null,null,null,null,null,null,null,null,null,null,null,null,null,null,null,null,null,null,null,null,null,null,null,null,null,null,null,null,null,null,null,"N/E",null,null,null,null,null,null,null,null,null,null,null,null,null,null,null,null,null,null,null,null,null,null,null,null,null,null,null,null,null,null,null,"N/E",null,null,null,null,null,null,null,null,null,null,null,null,null,null,null,null,null,null,null,null,null,null,null,null,null,null,null,null,null,null,null,"N/E",null,null,null,null,null,null,null,null,null,null,null,null,null,null,null,null,null,null,null,null,null,null,null,null,null,null,null,null,null,null,null,"N/E"]
[null,0,0,{"$f":"IF($B$1=5,TRUE,FALSE)","v":false},null,null,0,0,0,0,null,null,"CO8.itec3. Mettre en oeuvre un protocole d’essais et de mesures, interpréter les résultats",5,null,null,null,null,null,null,null,null,null,null,null,null,null,null,null,null,null,null,null,null,null,null,null,null,null,null,null,null,null,null,null,null,null,null,null,null,"N/E",null,null,null,null,null,null,null,null,null,null,null,null,null,null,null,null,null,null,null,null,null,null,null,null,null,null,null,null,null,null,null,"N/E",null,null,null,null,null,null,null,null,null,null,null,null,null,null,null,null,null,null,null,null,null,null,null,null,null,null,null,null,null,null,null,"N/E",null,null,null,null,null,null,null,null,null,null,null,null,null,null,null,null,null,null,null,null,null,null,null,null,null,null,null,null,null,null,null,"N/E",null,null,null,null,null,null,null,null,null,null,null,null,null,null,null,null,null,null,null,null,null,null,null,null,null,null,null,null,null,null,null,"N/E"]
[null,0,0,{"$f":"IF($B$1=5,TRUE,FALSE)","v":false},null,null,0,0,0,0,null,null,"CO8.itec4. Comparer et interpréter le résultat d'une simulation d'un comportement mécanique avec un comportement réel",3,null,null,null,null,null,null,null,null,null,null,null,null,null,null,null,null,null,null,null,null,null,null,null,null,null,null,null,null,null,null,null,null,null,null,null,null,"N/E",null,null,null,null,null,null,null,null,null,null,null,null,null,null,null,null,null,null,null,null,null,null,null,null,null,null,null,null,null,null,null,"N/E",null,null,null,null,null,null,null,null,null,null,null,null,null,null,null,null,null,null,null,null,null,null,null,null,null,null,null,null,null,null,null,"N/E",null,null,null,null,null,null,null,null,null,null,null,null,null,null,null,null,null,null,null,null,null,null,null,null,null,null,null,null,null,null,null,"N/E",null,null,null,null,null,null,null,null,null,null,null,null,null,null,null,null,null,null,null,null,null,null,null,null,null,null,null,null,null,null,null,"N/E"]
[null,0,0,{"$f":"IF($B$1=6,TRUE,FALSE)","v":false},null,null,0,0,0,0,null,null,"CO8.sin1. Rechercher et choisir une solution logicielle ou matérielle au regard de la définition d'un système",3,null,null,null,null,null,null,null,null,null,null,null,null,null,null,null,null,null,null,null,null,null,null,null,null,null,null,null,null,null,null,null,null,null,null,null,null,"N/E",null,null,null,null,null,null,null,null,null,null,null,null,null,null,null,null,null,null,null,null,null,null,null,null,null,null,null,null,null,null,null,"N/E",null,null,null,null,null,null,null,null,null,null,null,null,null,null,null,null,null,null,null,null,null,null,null,null,null,null,null,null,null,null,null,"N/E",null,null,null,null,null,null,null,null,null,null,null,null,null,null,null,null,null,null,null,null,null,null,null,null,null,null,null,null,null,null,null,"N/E",null,null,null,null,null,null,null,null,null,null,null,null,null,null,null,null,null,null,null,null,null,null,null,null,null,null,null,null,null,null,null,"N/E"]
[null,0,0,{"$f":"IF($B$1=6,TRUE,FALSE)","v":false},null,null,0,0,0,0,null,null,"CO8.sin2. Établir pour une fonction précédemment identifiée un modèle de comportement à partir de mesures faites sur le système",4,null,null,null,null,null,null,null,null,null,null,null,null,null,null,null,null,null,null,null,null,null,null,null,null,null,null,null,null,null,null,null,null,null,null,null,null,"N/E",null,null,null,null,null,null,null,null,null,null,null,null,null,null,null,null,null,null,null,null,null,null,null,null,null,null,null,null,null,null,null,"N/E",null,null,null,null,null,null,null,null,null,null,null,null,null,null,null,null,null,null,null,null,null,null,null,null,null,null,null,null,null,null,null,"N/E",null,null,null,null,null,null,null,null,null,null,null,null,null,null,null,null,null,null,null,null,null,null,null,null,null,null,null,null,null,null,null,"N/E",null,null,null,null,null,null,null,null,null,null,null,null,null,null,null,null,null,null,null,null,null,null,null,null,null,null,null,null,null,null,null,"N/E"]
[null,0,0,{"$f":"IF($B$1=6,TRUE,FALSE)","v":false},null,null,0,0,0,0,null,null,"CO8.sin3. Traduire sous forme graphique l’architecture de la chaîne d’information identifiée pour un système et définir les paramètres d’utilisation du simulateur",3,null,null,null,null,null,null,null,null,null,null,null,null,null,null,null,null,null,null,null,null,null,null,null,null,null,null,null,null,null,null,null,null,null,null,null,null,"N/E",null,null,null,null,null,null,null,null,null,null,null,null,null,null,null,null,null,null,null,null,null,null,null,null,null,null,null,null,null,null,null,"N/E",null,null,null,null,null,null,null,null,null,null,null,null,null,null,null,null,null,null,null,null,null,null,null,null,null,null,null,null,null,null,null,"N/E",null,null,null,null,null,null,null,null,null,null,null,null,null,null,null,null,null,null,null,null,null,null,null,null,null,null,null,null,null,null,null,"N/E",null,null,null,null,null,null,null,null,null,null,null,null,null,null,null,null,null,null,null,null,null,null,null,null,null,null,null,null,null,null,null,"N/E"]
[null,0,0,{"$f":"IF($B$1=6,TRUE,FALSE)","v":false},null,null,0,0,0,0,null,null,"CO8.sin4. Identifier les variables simulées et mesurées sur un système pour valider le choix d’une solution",4,null,null,null,null,null,null,null,null,null,null,null,null,null,null,null,null,null,null,null,null,null,null,null,null,null,null,null,null,null,null,null,null,null,null,null,null,"N/E",null,null,null,null,null,null,null,null,null,null,null,null,null,null,null,null,null,null,null,null,null,null,null,null,null,null,null,null,null,null,null,"N/E",null,null,null,null,null,null,null,null,null,null,null,null,null,null,null,null,null,null,null,null,null,null,null,null,null,null,null,null,null,null,null,"N/E",null,null,null,null,null,null,null,null,null,null,null,null,null,null,null,null,null,null,null,null,null,null,null,null,null,null,null,null,null,null,null,"N/E",null,null,null,null,null,null,null,null,null,null,null,null,null,null,null,null,null,null,null,null,null,null,null,null,null,null,null,null,null,null,null,"N/E"]
[null,0,{"$f":"IF(FX45=\"OK\",N45,0)","v":0},{"$f":"IF($B$1>2,TRUE,FALSE)","v":false},null,null,0,0,0,0,null,null,"CO8.es Justifier des éléments d'une simulation relative au comportement de tout ou partie d'un système et les écarts par rapport au réel",5,null,null,null,null,null,null,null,null,null,null,null,null,null,null,null,null,null,null,null,null,null,null,null,null,null,null,null,null,null,null,null,null,null,null,null,null,">",null,null,null,null,null,null,null,null,null,null,null,null,null,null,null,null,null,null,null,null,null,null,null,null,null,null,null,null,null,null,null,">",null,null,null,null,null,null,null,null,null,null,null,null,null,null,null,null,null,null,null,null,null,null,null,null,null,null,null,null,null,null,null,">",null,null,null,null,null,null,null,null,null,null,null,null,null,null,null,null,null,null,null,null,null,null,null,null,null,null,null,null,null,null,null,">",null,null,null,null,null,null,null,null,null,null,null,null,null,null,null,null,null,null,null,null,null,null,null,null,null,null,null,null,null,null,null,">",{"$f":"IF(COUNTA(U45:FW45)>5,\"OK\",\"N/E\")","v":"N/E"}]
[null,null,null,{"$f":"IF($B$1>2,TRUE,FALSE)","v":false},null,null,null,null,null,null,null,null,"O9 – Gérer la vie du produit"]
[null,0,{"$f":"IF(OR(CE47=\"OK\",EQ47=\"OK\"),N47,0)","v":0},{"$f":"IF($B$1=3,TRUE,FALSE)","v":false},null,null,0,0,0,0,null,null,"CO9.ac1. Améliorer les performances d’une construction du point de vue énergétique, domotique et informationnel",5,null,null,null,null,null,null,null,null,null,null,null,null,null,null,null,null,null,null,null,null,null,null,null,null,null,null,null,null,null,null,null,null,null,null,null,null,{"$f":"IF(AND(AY$1<>\"\",COUNTA(U47:AX47)>0),\"OK\",\"N/E\")","v":"N/E"},null,null,null,null,null,null,null,null,null,null,null,null,null,null,null,null,null,null,null,null,null,null,null,null,null,null,null,null,null,null,null,{"$f":"IF(AND(CE$1<>\"\",COUNTA(U47:CD47)>1),\"OK\",\"N/E\")","v":"N/E"},null,null,null,null,null,null,null,null,null,null,null,null,null,null,null,null,null,null,null,null,null,null,null,null,null,null,null,null,null,null,null,{"$f":"IF(AND(DK$1<>\"\",COUNTA(U47:DJ47)>2),\"OK\",\"N/E\")","v":"N/E"},null,null,null,null,null,null,null,null,null,null,null,null,null,null,null,null,null,null,null,null,null,null,null,null,null,null,null,null,null,null,null,{"$f":"IF(AND(EQ$1<>\"\",COUNTA(U47:EP47)>3),\"OK\",\"N/E\")","v":"N/E"},null,null,null,null,null,null,null,null,null,null,null,null,null,null,null,null,null,null,null,null,null,null,null,null,null,null,null,null,null,null,null,{"$f":"IF(AND(FW$1<>\"\",COUNTA(U47:FV47)>4),\"OK\",\"N/E\")","v":"N/E"}]
[null,0,0,{"$f":"IF($B$1=3,TRUE,FALSE)","v":false},null,null,0,0,0,0,null,null,"CO9.ac2. Identifier et décrire les causes de désordre dans une construction",3,null,null,null,null,null,null,null,null,null,null,null,null,null,null,null,null,null,null,null,null,null,null,null,null,null,null,null,null,null,null,null,null,null,null,null,null,"N/E",null,null,null,null,null,null,null,null,null,null,null,null,null,null,null,null,null,null,null,null,null,null,null,null,null,null,null,null,null,null,null,"N/E",null,null,null,null,null,null,null,null,null,null,null,null,null,null,null,null,null,null,null,null,null,null,null,null,null,null,null,null,null,null,null,"N/E",null,null,null,null,null,null,null,null,null,null,null,null,null,null,null,null,null,null,null,null,null,null,null,null,null,null,null,null,null,null,null,"N/E",null,null,null,null,null,null,null,null,null,null,null,null,null,null,null,null,null,null,null,null,null,null,null,null,null,null,null,null,null,null,null,"N/E"]
[null,0,0,{"$f":"IF($B$1=3,TRUE,FALSE)","v":false},null,null,0,0,0,0,null,null,"CO9.ac3. Valoriser la fin de vie du produit : déconstruction, gestion des déchets, valorisation des produits",3,null,null,null,null,null,null,null,null,null,null,null,null,null,null,null,null,null,null,null,null,null,null,null,null,null,null,null,null,null,null,null,null,null,null,null,null,"N/E",null,null,null,null,null,null,null,null,null,null,null,null,null,null,null,null,null,null,null,null,null,null,null,null,null,null,null,null,null,null,null,"N/E",null,null,null,null,null,null,null,null,null,null,null,null,null,null,null,null,null,null,null,null,null,null,null,null,null,null,null,null,null,null,null,"N/E",null,null,null,null,null,null,null,null,null,null,null,null,null,null,null,null,null,null,null,null,null,null,null,null,null,null,null,null,null,null,null,"N/E",null,null,null,null,null,null,null,null,null,null,null,null,null,null,null,null,null,null,null,null,null,null,null,null,null,null,null,null,null,null,null,"N/E"]
[null,0,0,{"$f":"IF($B$1=4,TRUE,FALSE)","v":false},null,null,0,0,0,0,null,null,"CO9.ee1. Expérimenter des procédés de stockage, de production, de transport, de transformation, d’énergie pour aider à la conception d’une chaîne d’énergie",3,null,null,null,null,null,null,null,null,null,null,null,null,null,null,null,null,null,null,null,null,null,null,null,null,null,null,null,null,null,null,null,null,null,null,null,null,"N/E",null,null,null,null,null,null,null,null,null,null,null,null,null,null,null,null,null,null,null,null,null,null,null,null,null,null,null,null,null,null,null,"N/E",null,null,null,null,null,null,null,null,null,null,null,null,null,null,null,null,null,null,null,null,null,null,null,null,null,null,null,null,null,null,null,"N/E",null,null,null,null,null,null,null,null,null,null,null,null,null,null,null,null,null,null,null,null,null,null,null,null,null,null,null,null,null,null,null,"N/E",null,null,null,null,null,null,null,null,null,null,null,null,null,null,null,null,null,null,null,null,null,null,null,null,null,null,null,null,null,null,null,"N/E"]
[null,0,0,{"$f":"IF($B$1=4,TRUE,FALSE)","v":false},null,null,0,0,0,0,null,null,"CO9.ee2. Réaliser et valider un prototype obtenu en réponse à tout ou partie du cahier des charges initial",4,null,null,null,null,null,null,null,null,null,null,null,null,null,null,null,null,null,null,null,null,null,null,null,null,null,null,null,null,null,null,null,null,null,null,null,null,"N/E",null,null,null,null,null,null,null,null,null,null,null,null,null,null,null,null,null,null,null,null,null,null,null,null,null,null,null,null,null,null,null,"N/E",null,null,null,null,null,null,null,null,null,null,null,null,null,null,null,null,null,null,null,null,null,null,null,null,null,null,null,null,null,null,null,"N/E",null,null,null,null,null,null,null,null,null,null,null,null,null,null,null,null,null,null,null,null,null,null,null,null,null,null,null,null,null,null,null,"N/E",null,null,null,null,null,null,null,null,null,null,null,null,null,null,null,null,null,null,null,null,null,null,null,null,null,null,null,null,null,null,null,"N/E"]
[null,0,0,{"$f":"IF($B$1=4,TRUE,FALSE)","v":false},null,null,0,0,0,0,null,null,"CO9.ee3. Intégrer un prototype dans un système à modifier pour valider son comportement et ses performances",4,null,null,null,null,null,null,null,null,null,null,null,null,null,null,null,null,null,null,null,null,null,null,null,null,null,null,null,null,null,null,null,null,null,null,null,null,"N/E",null,null,null,null,null,null,null,null,null,null,null,null,null,null,null,null,null,null,null,null,null,null,null,null,null,null,null,null,null,null,null,"N/E",null,null,null,null,null,null,null,null,null,null,null,null,null,null,null,null,null,null,null,null,null,null,null,null,null,null,null,null,null,null,null,"N/E",null,null,null,null,null,null,null,null,null,null,null,null,null,null,null,null,null,null,null,null,null,null,null,null,null,null,null,null,null,null,null,"N/E",null,null,null,null,null,null,null,null,null,null,null,null,null,null,null,null,null,null,null,null,null,null,null,null,null,null,null,null,null,null,null,"N/E"]
[null,0,0,{"$f":"IF($B$1=5,TRUE,FALSE)","v":false},null,null,0,0,0,0,null,null,"CO9.itec1. Expérimenter des procédés pour caractériser les paramètres de transformation de la matière et leurs conséquences sur la définition et l’obtention de pièces",3,null,null,null,null,null,null,null,null,null,null,null,null,null,null,null,null,null,null,null,null,null,null,null,null,null,null,null,null,null,null,null,null,null,null,null,null,"N/E",null,null,null,null,null,null,null,null,null,null,null,null,null,null,null,null,null,null,null,null,null,null,null,null,null,null,null,null,null,null,null,"N/E",null,null,null,null,null,null,null,null,null,null,null,null,null,null,null,null,null,null,null,null,null,null,null,null,null,null,null,null,null,null,null,"N/E",null,null,null,null,null,null,null,null,null,null,null,null,null,null,null,null,null,null,null,null,null,null,null,null,null,null,null,null,null,null,null,"N/E",null,null,null,null,null,null,null,null,null,null,null,null,null,null,null,null,null,null,null,null,null,null,null,null,null,null,null,null,null,null,null,"N/E"]
[null,0,0,{"$f":"IF($B$1=5,TRUE,FALSE)","v":false},null,null,0,0,0,0,null,null,"CO9.itec2. Réaliser et valider un prototype obtenu par rapport à tout ou partie du cahier des charges initial",4,null,null,null,null,null,null,null,null,null,null,null,null,null,null,null,null,null,null,null,null,null,null,null,null,null,null,null,null,null,null,null,null,null,null,null,null,"N/E",null,null,null,null,null,null,null,null,null,null,null,null,null,null,null,null,null,null,null,null,null,null,null,null,null,null,null,null,null,null,null,"N/E",null,null,null,null,null,null,null,null,null,null,null,null,null,null,null,null,null,null,null,null,null,null,null,null,null,null,null,null,null,null,null,"N/E",null,null,null,null,null,null,null,null,null,null,null,null,null,null,null,null,null,null,null,null,null,null,null,null,null,null,null,null,null,null,null,"N/E",null,null,null,null,null,null,null,null,null,null,null,null,null,null,null,null,null,null,null,null,null,null,null,null,null,null,null,null,null,null,null,"N/E"]
[null,0,0,{"$f":"IF($B$1=5,TRUE,FALSE)","v":false},null,null,0,0,0,0,null,null,"CO9.itec3. Intégrer les pièces prototypes dans le système à modifier pour valider son comportement et ses performances",4,null,null,null,null,null,null,null,null,null,null,null,null,null,null,null,null,null,null,null,null,null,null,null,null,null,null,null,null,null,null,null,null,null,null,null,null,"N/E",null,null,null,null,null,null,null,null,null,null,null,null,null,null,null,null,null,null,null,null,null,null,null,null,null,null,null,null,null,null,null,"N/E",null,null,null,null,null,null,null,null,null,null,null,null,null,null,null,null,null,null,null,null,null,null,null,null,null,null,null,null,null,null,null,"N/E",null,null,null,null,null,null,null,null,null,null,null,null,null,null,null,null,null,null,null,null,null,null,null,null,null,null,null,null,null,null,null,"N/E",null,null,null,null,null,null,null,null,null,null,null,null,null,null,null,null,null,null,null,null,null,null,null,null,null,null,null,null,null,null,null,"N/E"]
[null,0,0,{"$f":"IF($B$1=6,TRUE,FALSE)","v":false},null,null,0,0,0,0,null,null,"CO9.sin1. Utiliser les outils adaptés pour planifier un projet (diagramme de Gantt, chemin critique, données économiques, réunions de projet)",3,null,null,null,null,null,null,null,null,null,null,null,null,null,null,null,null,null,null,null,null,null,null,null,null,null,null,null,null,null,null,null,null,null,null,null,null,"N/E",null,null,null,null,null,null,null,null,null,null,null,null,null,null,null,null,null,null,null,null,null,null,null,null,null,null,null,null,null,null,null,"N/E",null,null,null,null,null,null,null,null,null,null,null,null,null,null,null,null,null,null,null,null,null,null,null,null,null,null,null,null,null,null,null,"N/E",null,null,null,null,null,null,null,null,null,null,null,null,null,null,null,null,null,null,null,null,null,null,null,null,null,null,null,null,null,null,null,"N/E",null,null,null,null,null,null,null,null,null,null,null,null,null,null,null,null,null,null,null,null,null,null,null,null,null,null,null,null,null,null,null,"N/E"]
[null,0,0,{"$f":"IF($B$1=6,TRUE,FALSE)","v":false},null,null,0,0,0,0,null,null,"CO9.sin2. Installer, configurer et instrumenter un système réel Mettre en oeuvre la chaîne d’acquisition puis acquérir, traiter, transmettre et restituer l’information",5,null,null,null,null,null,null,null,null,null,null,null,null,null,null,null,null,null,null,null,null,null,null,null,null,null,null,null,null,null,null,null,null,null,null,null,null,"N/E",null,null,null,null,null,null,null,null,null,null,null,null,null,null,null,null,null,null,null,null,null,null,null,null,null,null,null,null,null,null,null,"N/E",null,null,null,null,null,null,null,null,null,null,null,null,null,null,null,null,null,null,null,null,null,null,null,null,null,null,null,null,null,null,null,"N/E",null,null,null,null,null,null,null,null,null,null,null,null,null,null,null,null,null,null,null,null,null,null,null,null,null,null,null,null,null,null,null,"N/E",null,null,null,null,null,null,null,null,null,null,null,null,null,null,null,null,null,null,null,null,null,null,null,null,null,null,null,null,null,null,null,"N/E"]
[null,0,0,{"$f":"IF($B$1=6,TRUE,FALSE)","v":false},null,null,0,0,0,0,null,null,"CO9.sin3. Rechercher des évolutions de constituants dans le cadre d’une démarche de veille technologique, analyser la structure d'un système pour intervenir sur les constituants dans le cadre d'une opération de maintenance",4,null,null,null,null,null,null,null,null,null,null,null,null,null,null,null,null,null,null,null,null,null,null,null,null,null,null,null,null,null,null,null,null,null,null,null,null,"N/E",null,null,null,null,null,null,null,null,null,null,null,null,null,null,null,null,null,null,null,null,null,null,null,null,null,null,null,null,null,null,null,"N/E",null,null,null,null,null,null,null,null,null,null,null,null,null,null,null,null,null,null,null,null,null,null,null,null,null,null,null,null,null,null,null,"N/E",null,null,null,null,null,null,null,null,null,null,null,null,null,null,null,null,null,null,null,null,null,null,null,null,null,null,null,null,null,null,null,"N/E",null,null,null,null,null,null,null,null,null,null,null,null,null,null,null,null,null,null,null,null,null,null,null,null,null,null,null,null,null,null,null,"N/E"]
[null,0,0,{"$f":"IF($B$1=6,TRUE,FALSE)","v":false},null,null,0,0,0,0,null,null,"CO9.sin4. Rechercher et choisir de nouveaux constituants d’un système (ou d’un projet finalisé) au regard d’évolutions technologiques, socio-économiques spécifiées dans un cahier des charges. Organiser le projet permettant de « maquettiser » la solution choisie",5,null,null,null,null,null,null,null,null,null,null,null,null,null,null,null,null,null,null,null,null,null,null,null,null,null,null,null,null,null,null,null,null,null,null,null,null,"N/E",null,null,null,null,null,null,null,null,null,null,null,null,null,null,null,null,null,null,null,null,null,null,null,null,null,null,null,null,null,null,null,"N/E",null,null,null,null,null,null,null,null,null,null,null,null,null,null,null,null,null,null,null,null,null,null,null,null,null,null,null,null,null,null,null,"N/E",null,null,null,null,null,null,null,null,null,null,null,null,null,null,null,null,null,null,null,null,null,null,null,null,null,null,null,null,null,null,null,"N/E",null,null,null,null,null,null,null,null,null,null,null,null,null,null,null,null,null,null,null,null,null,null,null,null,null,null,null,null,null,null,null,"N/E"]
[null,null,null,{"$f":"IF($B$1=2,TRUE,FALSE)","v":false},null,null,null,null,null,null,null,"B","-  Modéliser",0.4]
[null,null,null,false,null,null,null,null,null,null,null,null,"B3 - Résoudre et simuler : Simuler le fonctionnement de tout ou partie d’un système à l’aide d’un modèle fourni"]
[null,{"$f":"N62*D62*$N$60","v":0},{"$f":"IF(COUNTA(T62:CD62)<>0,N62,0)","v":0.2},false,null,null,0,0,0,0,null,null,"Les paramètres influents sont identifiés",0.2,null,null,null,null,null,null,null,null,null,null,null,null,null,null,null,null,null,null,null,null,null,null,null,null,null,null,null,null,null,null,null,null,null,null,null,null,{"$f":"IF(AND(AY$1<>\"\",COUNTA(U62:AX62)>0),\"OK\",\"N/E\")","v":"N/E"},null,null,null,null,null,null,null,null,null,null,null,null,null,null,null,null,null,null,null,null,null,null,null,null,null,null,null,null,null,null,null,{"$f":"IF(AND(CE$1<>\"\",COUNTA(U62:CD62)>1),\"OK\",\"N/E\")","v":"N/E"},null,null,null,null,null,null,null,null,null,null,null,null,null,null,null,null,null,null,null,null,null,null,null,null,null,null,null,null,null,null,null,{"$f":"IF(AND(DK$1<>\"\",COUNTA(U62:DJ62)>2),\"OK\",\"N/E\")","v":"N/E"},null,null,null,null,null,null,null,null,null,null,null,null,null,null,null,null,null,null,null,null,null,null,null,null,null,null,null,null,null,null,null,{"$f":"IF(AND(EQ$1<>\"\",COUNTA(U62:EP62)>3),\"OK\",\"N/E\")","v":"N/E"},null,null,null,null,null,null,null,null,null,null,null,null,null,null,null,null,null,null,null,null,null,null,null,null,null,null,null,null,null,null,null,{"$f":"IF(AND(FW$1<>\"\",COUNTA(U62:FV62)>4),\"OK\",\"N/E\")","v":"N/E"}]
[null,{"$f":"N63*D63*$N$60","v":0},0.2,false,null,null,0,0,0,0,null,null,"Les limites de simulation sont correctement définies",0.2,null,null,null,null,null,null,null,null,null,null,null,null,null,null,null,null,null,null,null,null,null,null,null,null,null,null,null,null,null,null,null,null,null,null,null,null,{"$f":"IF(AND(AY$1<>\"\",COUNTA(U63:AX63)>0),\"OK\",\"N/E\")","v":"N/E"},null,null,null,null,null,null,null,null,null,null,null,null,null,null,null,null,null,null,null,null,null,null,null,null,null,null,null,null,null,null,null,{"$f":"IF(AND(CE$1<>\"\",COUNTA(U63:CD63)>1),\"OK\",\"N/E\")","v":"N/E"},null,null,null,null,null,null,null,null,null,null,null,null,null,null,null,null,null,null,null,null,null,null,null,null,null,null,null,null,null,null,null,{"$f":"IF(AND(DK$1<>\"\",COUNTA(U63:DJ63)>2),\"OK\",\"N/E\")","v":"N/E"},null,null,null,null,null,null,null,null,null,null,null,null,null,null,null,null,null,null,null,null,null,null,null,null,null,null,null,null,null,null,null,{"$f":"IF(AND(EQ$1<>\"\",COUNTA(U63:EP63)>3),\"OK\",\"N/E\")","v":"N/E"},null,null,null,null,null,null,null,null,null,null,null,null,null,null,null,null,null,null,null,null,null,null,null,null,null,null,null,null,null,null,null,{"$f":"IF(AND(FW$1<>\"\",COUNTA(U63:FV63)>4),\"OK\",\"N/E\")","v":"N/E"}]
[null,null,null,false,null,null,null,null,null,null,null,null,"B4 - Valider un modèle : Valider un modèle fourni, interpréter les résultats obtenus, préciser les limites de validité du modèle utilisé et modifier les paramètres du modèle pour répondre au cahier des charges ou aux résultats expérimentaux"]
[null,{"$f":"N65*D65*$N$60","v":0},0.15,false,null,null,0,0,0,0,null,null,"Les résultats sont correctement interprétés",0.15,null,null,null,null,null,null,null,null,null,null,null,null,null,null,null,null,null,null,null,null,null,null,null,null,null,null,null,null,null,null,null,null,null,null,null,null,">",null,null,null,null,null,null,null,null,null,null,null,null,null,null,null,null,null,null,null,null,null,null,null,null,null,null,null,null,null,null,null,">",null,null,null,null,null,null,null,null,null,null,null,null,null,null,null,null,null,null,null,null,null,null,null,null,null,null,null,null,null,null,null,">",null,null,null,null,null,null,null,null,null,null,null,null,null,null,null,null,null,null,null,null,null,null,null,null,null,null,null,null,null,null,null,">",null,null,null,null,null,null,null,null,null,null,null,null,null,null,null,null,null,null,null,null,null,null,null,null,null,null,null,null,null,null,null,">",{"$f":"IF(COUNTA(U65:FW65)>5,\"OK\",\"N/E\")","v":"N/E"}]
[null,{"$f":"N66*D66*$N$60","v":0},0.15,false,null,null,0,0,0,0,null,null,"Ces limites sont explicitées",0.15,null,null,null,null,null,null,null,null,null,null,null,null,null,null,null,null,null,null,null,null,null,null,null,null,null,null,null,null,null,null,null,null,null,null,null,null,">",null,null,null,null,null,null,null,null,null,null,null,null,null,null,null,null,null,null,null,null,null,null,null,null,null,null,null,null,null,null,null,">",null,null,null,null,null,null,null,null,null,null,null,null,null,null,null,null,null,null,null,null,null,null,null,null,null,null,null,null,null,null,null,">",null,null,null,null,null,null,null,null,null,null,null,null,null,null,null,null,null,null,null,null,null,null,null,null,null,null,null,null,null,null,null,">",null,null,null,null,null,null,null,null,null,null,null,null,null,null,null,null,null,null,null,null,null,null,null,null,null,null,null,null,null,null,null,">",{"$f":"IF(COUNTA(U66:FW66)>5,\"OK\",\"N/E\")","v":"N/E"}]
[null,{"$f":"N67*D67*$N$60","v":0},0.15,false,null,null,0,0,0,0,null,null,"Les paramètres modifiés sont pertinents",0.15,null,null,null,null,null,null,null,null,null,null,null,null,null,null,null,null,null,null,null,null,null,null,null,null,null,null,null,null,null,null,null,null,null,null,null,null,">",null,null,null,null,null,null,null,null,null,null,null,null,null,null,null,null,null,null,null,null,null,null,null,null,null,null,null,null,null,null,null,">",null,null,null,null,null,null,null,null,null,null,null,null,null,null,null,null,null,null,null,null,null,null,null,null,null,null,null,null,null,null,null,">",null,null,null,null,null,null,null,null,null,null,null,null,null,null,null,null,null,null,null,null,null,null,null,null,null,null,null,null,null,null,null,">",null,null,null,null,null,null,null,null,null,null,null,null,null,null,null,null,null,null,null,null,null,null,null,null,null,null,null,null,null,null,null,">",{"$f":"IF(COUNTA(U67:FW67)>5,\"OK\",\"N/E\")","v":"N/E"}]
[null,{"$f":"N68*D68*$N$60","v":0},0.15,false,null,null,0,0,0,0,null,null,"Le modèle modifié répond aux attentes ",0.15,null,null,null,null,null,null,null,null,null,null,null,null,null,null,null,null,null,null,null,null,null,null,null,null,null,null,null,null,null,null,null,null,null,null,null,null,">",null,null,null,null,null,null,null,null,null,null,null,null,null,null,null,null,null,null,null,null,null,null,null,null,null,null,null,null,null,null,null,">",null,null,null,null,null,null,null,null,null,null,null,null,null,null,null,null,null,null,null,null,null,null,null,null,null,null,null,null,null,null,null,">",null,null,null,null,null,null,null,null,null,null,null,null,null,null,null,null,null,null,null,null,null,null,null,null,null,null,null,null,null,null,null,">",null,null,null,null,null,null,null,null,null,null,null,null,null,null,null,null,null,null,null,null,null,null,null,null,null,null,null,null,null,null,null,">",{"$f":"IF(COUNTA(U68:FW68)>5,\"OK\",\"N/E\")","v":"N/E"}]
[null,null,null,false,null,null,null,null,null,null,null,"C","-  Expérimenter",0.4]
[null,null,null,false,null,null,null,null,null,null,null,null," C1 - Justifier le choix d’un protocole expérimental : Identifier les grandeurs physiques à mesurer, décrire une chaîne d'acquisition, identifier le comportement des composants et justifier le choix des essais réalisés"]
[null,{"$f":"N71*D71*$N$69","v":0},{"$f":"IF(COUNTA(T71:CD71)<>0,N71,0)","v":0.08},false,null,null,{"$f":"IF($FX71=\"\",$B71,0)","v":0},{"$f":"IF(OR($AY71=\"OK\",$CE71=\"OK\",$DK71=\"OK\",$EQ71=\"OK\",$FW71=\"OK\"),$B71,0)","v":0},{"$f":"IF($FX71=\"\",0,$B71)","v":0},{"$f":"IF($FX71=\"OK\",$B71,0)","v":0},null,null,"Les grandeurs spécifiques (d'entrée, sortie, matière d'œuvre…) sont correctement identifiées",0.08,null,null,null,null,null,null,null,null,null,null,null,null,null,null,null,null,null,null,null,null,null,null,null,null,null,null,null,null,null,null,null,null,null,null,null,null,{"$f":"IF(AND(AY$1<>\"\",COUNTA(U71:AX71)>0),\"OK\",\"N/E\")","v":"N/E"},null,null,null,null,null,null,null,null,null,null,null,null,null,null,null,null,null,null,null,null,null,null,null,null,null,null,null,null,null,null,null,{"$f":"IF(AND(CE$1<>\"\",COUNTA(U71:CD71)>1),\"OK\",\"N/E\")","v":"N/E"},null,null,null,null,null,null,null,null,null,null,null,null,null,null,null,null,null,null,null,null,null,null,null,null,null,null,null,null,null,null,null,{"$f":"IF(AND(DK$1<>\"\",COUNTA(U71:DJ71)>2),\"OK\",\"N/E\")","v":"N/E"},null,null,null,null,null,null,null,null,null,null,null,null,null,null,null,null,null,null,null,null,null,null,null,null,null,null,null,null,null,null,null,{"$f":"IF(AND(EQ$1<>\"\",COUNTA(U71:EP71)>3),\"OK\",\"N/E\")","v":"N/E"},null,null,null,null,null,null,null,null,null,null,null,null,null,null,null,null,null,null,null,null,null,null,null,null,null,null,null,null,null,null,null,{"$f":"IF(AND(FW$1<>\"\",COUNTA(U71:FV71)>4),\"OK\",\"N/E\")","v":"N/E"}]
[null,{"$f":"N72*D72*$N$69","v":0},0.08,false,null,null,0,0,0,0,null,null,"Les éléments de la chaîne sont correctement identifiés ",0.08,null,null,null,null,null,null,null,null,null,null,null,null,null,null,null,null,null,null,null,null,null,null,null,null,null,null,null,null,null,null,null,null,null,null,null,null,{"$f":"IF(AND(AY$1<>\"\",COUNTA(U72:AX72)>0),\"OK\",\"N/E\")","v":"N/E"},null,null,null,null,null,null,null,null,null,null,null,null,null,null,null,null,null,null,null,null,null,null,null,null,null,null,null,null,null,null,null,{"$f":"IF(AND(CE$1<>\"\",COUNTA(U72:CD72)>1),\"OK\",\"N/E\")","v":"N/E"},null,null,null,null,null,null,null,null,null,null,null,null,null,null,null,null,null,null,null,null,null,null,null,null,null,null,null,null,null,null,null,{"$f":"IF(AND(DK$1<>\"\",COUNTA(U72:DJ72)>2),\"OK\",\"N/E\")","v":"N/E"},null,null,null,null,null,null,null,null,null,null,null,null,null,null,null,null,null,null,null,null,null,null,null,null,null,null,null,null,null,null,null,{"$f":"IF(AND(EQ$1<>\"\",COUNTA(U72:EP72)>3),\"OK\",\"N/E\")","v":"N/E"},null,null,null,null,null,null,null,null,null,null,null,null,null,null,null,null,null,null,null,null,null,null,null,null,null,null,null,null,null,null,null,{"$f":"IF(AND(FW$1<>\"\",COUNTA(U72:FV72)>4),\"OK\",\"N/E\")","v":"N/E"}]
[null,{"$f":"N73*D73*$N$69","v":0},7.0000000000000007E-2,false,null,null,0,0,0,0,null,null,"Les choix et réglages des capteurs et appareils de mesure sont correctement explicités",7.0000000000000007E-2,null,null,null,null,null,null,null,null,null,null,null,null,null,null,null,null,null,null,null,null,null,null,null,null,null,null,null,null,null,null,null,null,null,null,null,null,{"$f":"IF(AND(AY$1<>\"\",COUNTA(U73:AX73)>0),\"OK\",\"N/E\")","v":"N/E"},null,null,null,null,null,null,null,null,null,null,null,null,null,null,null,null,null,null,null,null,null,null,null,null,null,null,null,null,null,null,null,{"$f":"IF(AND(CE$1<>\"\",COUNTA(U73:CD73)>1),\"OK\",\"N/E\")","v":"N/E"},null,null,null,null,null,null,null,null,null,null,null,null,null,null,null,null,null,null,null,null,null,null,null,null,null,null,null,null,null,null,null,{"$f":"IF(AND(DK$1<>\"\",COUNTA(U73:DJ73)>2),\"OK\",\"N/E\")","v":"N/E"},null,null,null,null,null,null,null,null,null,null,null,null,null,null,null,null,null,null,null,null,null,null,null,null,null,null,null,null,null,null,null,{"$f":"IF(AND(EQ$1<>\"\",COUNTA(U73:EP73)>3),\"OK\",\"N/E\")","v":"N/E"},null,null,null,null,null,null,null,null,null,null,null,null,null,null,null,null,null,null,null,null,null,null,null,null,null,null,null,null,null,null,null,{"$f":"IF(AND(FW$1<>\"\",COUNTA(U73:FV73)>4),\"OK\",\"N/E\")","v":"N/E"}]
[null,{"$f":"N74*D74*$N$69","v":0},0.1,false,null,null,0,0,0,0,null,null,"Un protocole expérimental adapté de recueil de résultats est conçu ou complété, validé et mis en œuvre",0.1,null,null,null,null,null,null,null,null,null,null,null,null,null,null,null,null,null,null,null,null,null,null,null,null,null,null,null,null,null,null,null,null,null,null,null,null,{"$f":"IF(AND(AY$1<>\"\",COUNTA(U74:AX74)>0),\"OK\",\"N/E\")","v":"N/E"},null,null,null,null,null,null,null,null,null,null,null,null,null,null,null,null,null,null,null,null,null,null,null,null,null,null,null,null,null,null,null,{"$f":"IF(AND(CE$1<>\"\",COUNTA(U74:CD74)>1),\"OK\",\"N/E\")","v":"N/E"},null,null,null,null,null,null,null,null,null,null,null,null,null,null,null,null,null,null,null,null,null,null,null,null,null,null,null,null,null,null,null,{"$f":"IF(AND(DK$1<>\"\",COUNTA(U74:DJ74)>2),\"OK\",\"N/E\")","v":"N/E"},null,null,null,null,null,null,null,null,null,null,null,null,null,null,null,null,null,null,null,null,null,null,null,null,null,null,null,null,null,null,null,{"$f":"IF(AND(EQ$1<>\"\",COUNTA(U74:EP74)>3),\"OK\",\"N/E\")","v":"N/E"},null,null,null,null,null,null,null,null,null,null,null,null,null,null,null,null,null,null,null,null,null,null,null,null,null,null,null,null,null,null,null,{"$f":"IF(AND(FW$1<>\"\",COUNTA(U74:FV74)>4),\"OK\",\"N/E\")","v":"N/E"}]
[null,{"$f":"N75*D75*$N$69","v":0},0.05,false,null,null,0,0,0,0,null,null,"Le comportement est précisément décrit",0.05,null,null,null,null,null,null,null,null,null,null,null,null,null,null,null,null,null,null,null,null,null,null,null,null,null,null,null,null,null,null,null,null,null,null,null,null,">",null,null,null,null,null,null,null,null,null,null,null,null,null,null,null,null,null,null,null,null,null,null,null,null,null,null,null,null,null,null,null,">",null,null,null,null,null,null,null,null,null,null,null,null,null,null,null,null,null,null,null,null,null,null,null,null,null,null,null,null,null,null,null,">",null,null,null,null,null,null,null,null,null,null,null,null,null,null,null,null,null,null,null,null,null,null,null,null,null,null,null,null,null,null,null,">",null,null,null,null,null,null,null,null,null,null,null,null,null,null,null,null,null,null,null,null,null,null,null,null,null,null,null,null,null,null,null,">",{"$f":"IF(COUNTA(U75:FW75)>5,\"OK\",\"N/E\")","v":"N/E"}]
[null,null,null,false,null,null,null,null,null,null,null,null,"C2 - Mettre en œuvre un protocole expérimental : Conduire les essais en respectant les consignes de sécurité à partir d’un protocole fourni et traiter les données mesurées en vue d’analyser les écarts"]
[null,{"$f":"N77*D77*$N$69","v":0},0.08,false,null,null,0,0,0,0,null,null,"Les capteurs et appareils de mesure sont correctement mis en œuvre",0.08,null,null,null,null,null,null,null,null,null,null,null,null,null,null,null,null,null,null,null,null,null,null,null,null,null,null,null,null,null,null,null,null,null,null,null,null,{"$f":"IF(AND(AY$1<>\"\",COUNTA(U77:AX77)>0),\"OK\",\"N/E\")","v":"N/E"},null,null,null,null,null,null,null,null,null,null,null,null,null,null,null,null,null,null,null,null,null,null,null,null,null,null,null,null,null,null,null,{"$f":"IF(AND(CE$1<>\"\",COUNTA(U77:CD77)>1),\"OK\",\"N/E\")","v":"N/E"},null,null,null,null,null,null,null,null,null,null,null,null,null,null,null,null,null,null,null,null,null,null,null,null,null,null,null,null,null,null,null,{"$f":"IF(AND(DK$1<>\"\",COUNTA(U77:DJ77)>2),\"OK\",\"N/E\")","v":"N/E"},null,null,null,null,null,null,null,null,null,null,null,null,null,null,null,null,null,null,null,null,null,null,null,null,null,null,null,null,null,null,null,{"$f":"IF(AND(EQ$1<>\"\",COUNTA(U77:EP77)>3),\"OK\",\"N/E\")","v":"N/E"},null,null,null,null,null,null,null,null,null,null,null,null,null,null,null,null,null,null,null,null,null,null,null,null,null,null,null,null,null,null,null,{"$f":"IF(AND(FW$1<>\"\",COUNTA(U77:FV77)>4),\"OK\",\"N/E\")","v":"N/E"}]
[null,0,0.08,false,null,null,0,0,0,0,null,null,"Le système étudié est correctement mis en œuvre",0.08,null,null,null,null,null,null,null,null,null,null,null,null,null,null,null,null,null,null,null,null,null,null,null,null,null,null,null,null,null,null,null,null,null,null,null,null,"N/E",null,null,null,null,null,null,null,null,null,null,null,null,null,null,null,null,null,null,null,null,null,null,null,null,null,null,null,null,null,null,null,"N/E",null,null,null,null,null,null,null,null,null,null,null,null,null,null,null,null,null,null,null,null,null,null,null,null,null,null,null,null,null,null,null,"N/E",null,null,null,null,null,null,null,null,null,null,null,null,null,null,null,null,null,null,null,null,null,null,null,null,null,null,null,null,null,null,null,"N/E",null,null,null,null,null,null,null,null,null,null,null,null,null,null,null,null,null,null,null,null,null,null,null,null,null,null,null,null,null,null,null,"N/E"]
[null,0,0.08,false,null,null,0,0,0,0,null,null,"Les règles de sécurité sont connues et respectées",0.08,null,null,null,null,null,null,null,null,null,null,null,null,null,null,null,null,null,null,null,null,null,null,null,null,null,null,null,null,null,null,null,null,null,null,null,null,"N/E",null,null,null,null,null,null,null,null,null,null,null,null,null,null,null,null,null,null,null,null,null,null,null,null,null,null,null,null,null,null,null,"N/E",null,null,null,null,null,null,null,null,null,null,null,null,null,null,null,null,null,null,null,null,null,null,null,null,null,null,null,null,null,null,null,"N/E",null,null,null,null,null,null,null,null,null,null,null,null,null,null,null,null,null,null,null,null,null,null,null,null,null,null,null,null,null,null,null,"N/E",null,null,null,null,null,null,null,null,null,null,null,null,null,null,null,null,null,null,null,null,null,null,null,null,null,null,null,null,null,null,null,"N/E"]
[null,0,0.09,false,null,null,0,0,0,0,null,null,"Les résultats sont présentés clairement",0.09,null,null,null,null,null,null,null,null,null,null,null,null,null,null,null,null,null,null,null,null,null,null,null,null,null,null,null,null,null,null,null,null,null,null,null,null,"N/E",null,null,null,null,null,null,null,null,null,null,null,null,null,null,null,null,null,null,null,null,null,null,null,null,null,null,null,null,null,null,null,"N/E",null,null,null,null,null,null,null,null,null,null,null,null,null,null,null,null,null,null,null,null,null,null,null,null,null,null,null,null,null,null,null,"N/E",null,null,null,null,null,null,null,null,null,null,null,null,null,null,null,null,null,null,null,null,null,null,null,null,null,null,null,null,null,null,null,"N/E",null,null,null,null,null,null,null,null,null,null,null,null,null,null,null,null,null,null,null,null,null,null,null,null,null,null,null,null,null,null,null,"N/E"]
[null,0,0.1,false,null,null,0,0,0,0,null,null,"Les protocole d'essai est respecté",0.1,null,null,null,null,null,null,null,null,null,null,null,null,null,null,null,null,null,null,null,null,null,null,null,null,null,null,null,null,null,null,null,null,null,null,null,null,"N/E",null,null,null,null,null,null,null,null,null,null,null,null,null,null,null,null,null,null,null,null,null,null,null,null,null,null,null,null,null,null,null,"N/E",null,null,null,null,null,null,null,null,null,null,null,null,null,null,null,null,null,null,null,null,null,null,null,null,null,null,null,null,null,null,null,"N/E",null,null,null,null,null,null,null,null,null,null,null,null,null,null,null,null,null,null,null,null,null,null,null,null,null,null,null,null,null,null,null,"N/E",null,null,null,null,null,null,null,null,null,null,null,null,null,null,null,null,null,null,null,null,null,null,null,null,null,null,null,null,null,null,null,"N/E"]
[null,0,0.09,false,null,null,0,0,0,0,null,null,"Les méthodes et outils de traitement sont cohérents avec le problème posé",0.09,null,null,null,null,null,null,null,null,null,null,null,null,null,null,null,null,null,null,null,null,null,null,null,null,null,null,null,null,null,null,null,null,null,null,null,null,"N/E",null,null,null,null,null,null,null,null,null,null,null,null,null,null,null,null,null,null,null,null,null,null,null,null,null,null,null,null,null,null,null,"N/E",null,null,null,null,null,null,null,null,null,null,null,null,null,null,null,null,null,null,null,null,null,null,null,null,null,null,null,null,null,null,null,"N/E",null,null,null,null,null,null,null,null,null,null,null,null,null,null,null,null,null,null,null,null,null,null,null,null,null,null,null,null,null,null,null,"N/E",null,null,null,null,null,null,null,null,null,null,null,null,null,null,null,null,null,null,null,null,null,null,null,null,null,null,null,null,null,null,null,"N/E"]
[null,0,0.1,false,null,null,0,0,0,0,null,null,"Les résultats sont correctement analysés",0.1,null,null,null,null,null,null,null,null,null,null,null,null,null,null,null,null,null,null,null,null,null,null,null,null,null,null,null,null,null,null,null,null,null,null,null,null,">",null,null,null,null,null,null,null,null,null,null,null,null,null,null,null,null,null,null,null,null,null,null,null,null,null,null,null,null,null,null,null,">",null,null,null,null,null,null,null,null,null,null,null,null,null,null,null,null,null,null,null,null,null,null,null,null,null,null,null,null,null,null,null,">",null,null,null,null,null,null,null,null,null,null,null,null,null,null,null,null,null,null,null,null,null,null,null,null,null,null,null,null,null,null,null,">",null,null,null,null,null,null,null,null,null,null,null,null,null,null,null,null,null,null,null,null,null,null,null,null,null,null,null,null,null,null,null,">",{"$f":"IF(COUNTA(U83:FW83)>5,\"OK\",\"N/E\")","v":"N/E"}]
[null,null,null,false,null,null,null,null,null,null,null,"D","-  Communiquer",0.2]
[null,null,null,false,null,null,null,null,null,null,null,null,"D1 - Rechercher et traiter des informations : Rechercher des informations, analyser, choisir et classer des informations"]
[null,{"$f":"N86*D86*$N$84","v":0},{"$f":"IF(COUNTA(T86:CD86)<>0,N86,0)","v":0.1},false,null,null,0,0,0,0,null,null,"Les outils de recherche documentaire sont bien choisis",0.1,null,null,null,null,null,null,null,null,null,null,null,null,null,null,null,null,null,null,null,null,null,null,null,null,null,null,null,null,null,null,null,null,null,null,null,null,">",null,null,null,null,null,null,null,null,null,null,null,null,null,null,null,null,null,null,null,null,null,null,null,null,null,null,null,null,null,null,null,">",null,null,null,null,null,null,null,null,null,null,null,null,null,null,null,null,null,null,null,null,null,null,null,null,null,null,null,null,null,null,null,">",null,null,null,null,null,null,null,null,null,null,null,null,null,null,null,null,null,null,null,null,null,null,null,null,null,null,null,null,null,null,null,">",null,null,null,null,null,null,null,null,null,null,null,null,null,null,null,null,null,null,null,null,null,null,null,null,null,null,null,null,null,null,null,">",{"$f":"IF(COUNTA(U86:FW86)>5,\"OK\",\"N/E\")","v":"N/E"}]
[null,{"$f":"N87*D87*$N$84","v":0},{"$f":"IF(COUNTA(T87:CD87)<>0,N87,0)","v":0.05},false,null,null,0,0,0,0,null,null,"Les techniques de recherche documentaire sont maîtrisées",0.05,null,null,null,null,null,null,null,null,null,null,null,null,null,null,null,null,null,null,null,null,null,null,null,null,null,null,null,null,null,null,null,null,null,null,null,null,">",null,null,null,null,null,null,null,null,null,null,null,null,null,null,null,null,null,null,null,null,null,null,null,null,null,null,null,null,null,null,null,">",null,null,null,null,null,null,null,null,null,null,null,null,null,null,null,null,null,null,null,null,null,null,null,null,null,null,null,null,null,null,null,">",null,null,null,null,null,null,null,null,null,null,null,null,null,null,null,null,null,null,null,null,null,null,null,null,null,null,null,null,null,null,null,">",null,null,null,null,null,null,null,null,null,null,null,null,null,null,null,null,null,null,null,null,null,null,null,null,null,null,null,null,null,null,null,">",{"$f":"IF(COUNTA(U87:FW87)>5,\"OK\",\"N/E\")","v":"N/E"}]
[null,{"$f":"N88*D88*$N$84","v":0},{"$f":"IF(COUNTA(T88:CD88)<>0,N88,0)","v":0.05},false,null,null,0,0,0,0,null,null,"Les informations conservées sont opportunes",0.05,null,null,null,null,null,null,null,null,null,null,null,null,null,null,null,null,null,null,null,null,null,null,null,null,null,null,null,null,null,null,null,null,null,null,null,null,">",null,null,null,null,null,null,null,null,null,null,null,null,null,null,null,null,null,null,null,null,null,null,null,null,null,null,null,null,null,null,null,">",null,null,null,null,null,null,null,null,null,null,null,null,null,null,null,null,null,null,null,null,null,null,null,null,null,null,null,null,null,null,null,">",null,null,null,null,null,null,null,null,null,null,null,null,null,null,null,null,null,null,null,null,null,null,null,null,null,null,null,null,null,null,null,">",null,null,null,null,null,null,null,null,null,null,null,null,null,null,null,null,null,null,null,null,null,null,null,null,null,null,null,null,null,null,null,">",{"$f":"IF(COUNTA(U88:FW88)>5,\"OK\",\"N/E\")","v":"N/E"}]
[null,{"$f":"N89*D89*$N$84","v":0},{"$f":"IF(COUNTA(T89:CD89)<>0,N89,0)","v":0.1},false,null,null,0,0,0,0,null,null,"Le classement des données permet de les retrouver rapidement",0.1,null,null,null,null,null,null,null,null,null,null,null,null,null,null,null,null,null,null,null,null,null,null,null,null,null,null,null,null,null,null,null,null,null,null,null,null,">",null,null,null,null,null,null,null,null,null,null,null,null,null,null,null,null,null,null,null,null,null,null,null,null,null,null,null,null,null,null,null,">",null,null,null,null,null,null,null,null,null,null,null,null,null,null,null,null,null,null,null,null,null,null,null,null,null,null,null,null,null,null,null,">",null,null,null,null,null,null,null,null,null,null,null,null,null,null,null,null,null,null,null,null,null,null,null,null,null,null,null,null,null,null,null,">",null,null,null,null,null,null,null,null,null,null,null,null,null,null,null,null,null,null,null,null,null,null,null,null,null,null,null,null,null,null,null,">",{"$f":"IF(COUNTA(U89:FW89)>5,\"OK\",\"N/E\")","v":"N/E"}]
[null,null,null,false,null,null,null,null,null,null,null,null,"D2 - Mettre en œuvre une communication : Choisir un support de communication et un média adapté, argumenter, produire un support de communication et adapter sa stratégie de communication au contexte"]
[null,{"$f":"N91*D91*$N$84","v":0},{"$f":"IF(COUNTA(T91:CD91)<>0,N91,0)","v":0.2},false,null,null,0,0,0,0,null,null,"Les outils de communication sont maîtrisés",0.2,null,null,null,null,null,null,null,null,null,null,null,null,null,null,null,null,null,null,null,null,null,null,null,null,null,null,null,null,null,null,null,null,null,null,null,null,">",null,null,null,null,null,null,null,null,null,null,null,null,null,null,null,null,null,null,null,null,null,null,null,null,null,null,null,null,null,null,null,">",null,null,null,null,null,null,null,null,null,null,null,null,null,null,null,null,null,null,null,null,null,null,null,null,null,null,null,null,null,null,null,">",null,null,null,null,null,null,null,null,null,null,null,null,null,null,null,null,null,null,null,null,null,null,null,null,null,null,null,null,null,null,null,">",null,null,null,null,null,null,null,null,null,null,null,null,null,null,null,null,null,null,null,null,null,null,null,null,null,null,null,null,null,null,null,">",{"$f":"IF(COUNTA(U91:FW91)>5,\"OK\",\"N/E\")","v":"N/E"}]
[null,{"$f":"N92*D92*$N$84","v":0},{"$f":"IF(COUNTA(T92:CD92)<>0,N92,0)","v":0.1},false,null,null,0,0,0,0,null,null,"Le support utilisé est adapté",0.1,null,null,null,null,null,null,null,null,null,null,null,null,null,null,null,null,null,null,null,null,null,null,null,null,null,null,null,null,null,null,null,null,null,null,null,null,">",null,null,null,null,null,null,null,null,null,null,null,null,null,null,null,null,null,null,null,null,null,null,null,null,null,null,null,null,null,null,null,">",null,null,null,null,null,null,null,null,null,null,null,null,null,null,null,null,null,null,null,null,null,null,null,null,null,null,null,null,null,null,null,">",null,null,null,null,null,null,null,null,null,null,null,null,null,null,null,null,null,null,null,null,null,null,null,null,null,null,null,null,null,null,null,">",null,null,null,null,null,null,null,null,null,null,null,null,null,null,null,null,null,null,null,null,null,null,null,null,null,null,null,null,null,null,null,">",{"$f":"IF(COUNTA(U92:FW92)>5,\"OK\",\"N/E\")","v":"N/E"}]
[null,{"$f":"N93*D93*$N$84","v":0},{"$f":"IF(COUNTA(T93:CD93)<>0,N93,0)","v":0.2},false,null,null,0,0,0,0,null,null,"La production finale permet la compréhension du problème et de sa résolution ",0.2,null,null,null,null,null,null,null,null,null,null,null,null,null,null,null,null,null,null,null,null,null,null,null,null,null,null,null,null,null,null,null,null,null,null,null,null,">",null,null,null,null,null,null,null,null,null,null,null,null,null,null,null,null,null,null,null,null,null,null,null,null,null,null,null,null,null,null,null,">",null,null,null,null,null,null,null,null,null,null,null,null,null,null,null,null,null,null,null,null,null,null,null,null,null,null,null,null,null,null,null,">",null,null,null,null,null,null,null,null,null,null,null,null,null,null,null,null,null,null,null,null,null,null,null,null,null,null,null,null,null,null,null,">",null,null,null,null,null,null,null,null,null,null,null,null,null,null,null,null,null,null,null,null,null,null,null,null,null,null,null,null,null,null,null,">",{"$f":"IF(COUNTA(U93:FW93)>5,\"OK\",\"N/E\")","v":"N/E"}]
[null,{"$f":"N94*D94*$N$84","v":0},{"$f":"IF(COUNTA(T94:CD94)<>0,N94,0)","v":0.2},false,null,null,0,0,0,0,null,null,"La production respecte le cahier des charges (écrit/oral, texte/vidéo, durée, public visé, …)",0.2,null,null,null,null,null,null,null,null,null,null,null,null,null,null,null,null,null,null,null,null,null,null,null,null,null,null,null,null,null,null,null,null,null,null,null,null,">",null,null,null,null,null,null,null,null,null,null,null,null,null,null,null,null,null,null,null,null,null,null,null,null,null,null,null,null,null,null,null,">",null,null,null,null,null,null,null,null,null,null,null,null,null,null,null,null,null,null,null,null,null,null,null,null,null,null,null,null,null,null,null,">",null,null,null,null,null,null,null,null,null,null,null,null,null,null,null,null,null,null,null,null,null,null,null,null,null,null,null,null,null,null,null,">",null,null,null,null,null,null,null,null,null,null,null,null,null,null,null,null,null,null,null,null,null,null,null,null,null,null,null,null,null,null,null,">",{"$f":"IF(COUNTA(U94:FW94)>5,\"OK\",\"N/E\")","v":"N/E"}]
[null,null,null,{"$f":"IF($B$1>2,TRUE,FALSE)","v":false}]
[null,null,null,{"$f":"IF($B$1>2,TRUE,FALSE)","v":false},null,null,null,null,null,null,null,null,"Evaluation en cours d'année"]
[null,null,null,{"$f":"IF($B$1>2,TRUE,FALSE)","v":false},null,null,null,null,null,null,null,null,"Soutenance finale"]

{"sheet":"Elève E","index":7,"n_rows":97,"n_cols":180,"rows_kept":97,"cut":false,"hidden":false,"merged":[]}
[null,{"$f":"parametres!G6","v":1},null,true,null,null,"IR_t","IR_e","IS_t","IS_e",null,null,{"$f":"CONCATENATE(\"E : \",Synthèse!E25,\" \",Synthèse!F25)","v":"E : E e"},null,null,{"$f":"IF($B$2<>0,H2/G2,\"X\")","v":"X"},{"$f":"IF($B$2<>0,J2/I2,\"X\")","v":"X"},{"$f":"IF($B$2<>0,(H2+J2)/(G2+I2),0)","v":0},null,{"$f":"TRANSPOSE('Déclinaison projet'!Y10:Y170)","v":""},"","","","","","","","","","","","","","","","","","","","","","","","","","","","","","","","","","","","","","","","","","","","","","","","","","","","","","","","","","","","","","","REVUE DE PROJET - Conception préliminaire","","","","","","","","","","","","","","","","","","","","","","","","","","","","","","","","REVUE DE PROJET - Conception détaillée","","","","","","","","","","","","","","","","","","","","","","","","","","","","","","","","REVUE DE PROJET - Réalisation","","","","","","","","","","","","","","","","","","","","","","","","","","","","","","","","REVUE DE PROJET - Validation","SOUTENANCE FINALE DU PROJET"]
[null,{"$f":"SUM(B4:B94)","v":0},null,true,null,null,{"$f":"SUM(G4:G94)","v":0},{"$f":"SUM(H4:H94)","v":0},{"$f":"SUM(I4:I94)","v":0},{"$f":"SUM(J4:J94)","v":0},null,null,null,null,null,"Tx Indic. REVUES","Tx Indic. SOUTEN.","Taux Global"]
[]
[null,null,null,{"$f":"IF($B$1>2,TRUE,FALSE)","v":false},null,null,null,null,null,null,null,null,"O1 -  Caractériser des systèmes privilégiant un usage raisonné du point de vue développement durable"]
[null,{"$f":"N5*D5","v":0},{"$f":"IF(FX5=\"OK\",N5,0)","v":0},false,null,null,{"$f":"IF($FX5=\"\",$B5,0)","v":0},{"$f":"IF(OR($AY5=\"OK\",$CE5=\"OK\",$DK5=\"OK\",$EQ5=\"OK\",$FW5=\"OK\"),$B5,0)","v":0},{"$f":"IF($FX5=\"\",0,$B5)","v":0},{"$f":"IF($FX5=\"OK\",$B5,0)","v":0},null,null,"CO1.1. Justifier les choix des matériaux, des structures d’un système et les énergies mises en oeuvre dans une approche de développement durable",5,null,null,null,null,null,null,null,null,null,null,null,null,null,null,null,null,null,null,null,null,null,null,null,null,null,null,null,null,null,null,null,null,null,null,null,null,">",null,null,null,null,null,null,null,null,null,null,null,null,null,null,null,null,null,null,null,null,null,null,null,null,null,null,null,null,null,null,null,">",null,null,null,null,null,null,null,null,null,null,null,null,null,null,null,null,null,null,null,null,null,null,null,null,null,null,null,null,null,null,null,">",null,null,null,null,null,null,null,null,null,null,null,null,null,null,null,null,null,null,null,null,null,null,null,null,null,null,null,null,null,null,null,">",null,null,null,null,null,null,null,null,null,null,null,null,null,null,null,null,null,null,null,null,null,null,null,null,null,null,null,null,null,null,null,">",{"$f":"IF(COUNTA(U5:FW5)>5,\"OK\",\"N/E\")","v":"N/E"}]
[null,0,{"$f":"IF(FX6=\"OK\",N6,0)","v":0},false,null,null,{"$f":"IF($FX6=\"\",$B6,0)","v":0},{"$f":"IF(OR($AY6=\"OK\",$CE6=\"OK\",$DK6=\"OK\",$EQ6=\"OK\",$FW6=\"OK\"),$B6,0)","v":0},{"$f":"IF($FX6=\"\",0,$B6)","v":0},{"$f":"IF($FX6=\"OK\",$B6,0)","v":0},null,null,"CO1.2. Justifier le choix d’une solution selon des contraintes d’ergonomie et d’effets sur la santé de l’homme et du vivant",3,null,null,null,null,null,null,null,null,null,null,null,null,null,null,null,null,null,null,null,null,null,null,null,null,null,null,null,null,null,null,null,null,null,null,null,null,">",null,null,null,null,null,null,null,null,null,null,null,null,null,null,null,null,null,null,null,null,null,null,null,null,null,null,null,null,null,null,null,">",null,null,null,null,null,null,null,null,null,null,null,null,null,null,null,null,null,null,null,null,null,null,null,null,null,null,null,null,null,null,null,">",null,null,null,null,null,null,null,null,null,null,null,null,null,null,null,null,null,null,null,null,null,null,null,null,null,null,null,null,null,null,null,">",null,null,null,null,null,null,null,null,null,null,null,null,null,null,null,null,null,null,null,null,null,null,null,null,null,null,null,null,null,null,null,">",{"$f":"IF(COUNTA(U6:FW6)>5,\"OK\",\"N/E\")","v":"N/E"}]
[null,null,null,false,null,null,null,null,null,null,null,null,"O2 - Identifier les éléments permettant la limitation de l’Impact environnemental d’un système et de ses constituants"]
[null,0,{"$f":"IF(FX8=\"OK\",N8,0)","v":0},false,null,null,0,0,0,0,null,null,"CO2.1. Identifier les flux et la forme de l’énergie, caractériser ses transformations et/ou modulations et estimer l’efficacité énergétique globale d’un système",4,null,null,null,null,null,null,null,null,null,null,null,null,null,null,null,null,null,null,null,null,null,null,null,null,null,null,null,null,null,null,null,null,null,null,null,null,">",null,null,null,null,null,null,null,null,null,null,null,null,null,null,null,null,null,null,null,null,null,null,null,null,null,null,null,null,null,null,null,">",null,null,null,null,null,null,null,null,null,null,null,null,null,null,null,null,null,null,null,null,null,null,null,null,null,null,null,null,null,null,null,">",null,null,null,null,null,null,null,null,null,null,null,null,null,null,null,null,null,null,null,null,null,null,null,null,null,null,null,null,null,null,null,">",null,null,null,null,null,null,null,null,null,null,null,null,null,null,null,null,null,null,null,null,null,null,null,null,null,null,null,null,null,null,null,">",{"$f":"IF(COUNTA(U8:FW8)>5,\"OK\",\"N/E\")","v":"N/E"}]
[null,0,{"$f":"IF(FX9=\"OK\",N9,0)","v":0},false,null,null,0,0,0,0,null,null,"CO2.2. Justifier les solutions constructives d’un système au regard des impacts environnementaux et économiques engendrés tout au long de son cycle de vie",5,null,null,null,null,null,null,null,null,null,null,null,null,null,null,null,null,null,null,null,null,null,null,null,null,null,null,null,null,null,null,null,null,null,null,null,null,">",null,null,null,null,null,null,null,null,null,null,null,null,null,null,null,null,null,null,null,null,null,null,null,null,null,null,null,null,null,null,null,">",null,null,null,null,null,null,null,null,null,null,null,null,null,null,null,null,null,null,null,null,null,null,null,null,null,null,null,null,null,null,null,">",null,null,null,null,null,null,null,null,null,null,null,null,null,null,null,null,null,null,null,null,null,null,null,null,null,null,null,null,null,null,null,">",null,null,null,null,null,null,null,null,null,null,null,null,null,null,null,null,null,null,null,null,null,null,null,null,null,null,null,null,null,null,null,">",{"$f":"IF(COUNTA(U9:FW9)>5,\"OK\",\"N/E\")","v":"N/E"}]
[null,null,null,false,null,null,null,null,null,null,null,null,"O6 - Communiquer une idée, un principe ou une solution technique, un projet, y compris en langue étrangère"]
[null,0,{"$f":"IF(FX11=\"OK\",N11,0)","v":0},false,null,null,0,0,0,0,null,null,"CO6.1. Décrire une idée, un principe, une solution, un projet en utilisant des outils de représentation adaptés",3,null,null,null,null,null,null,null,null,null,null,null,null,null,null,null,null,null,null,null,null,null,null,null,null,null,null,null,null,null,null,null,null,null,null,null,null,">",null,null,null,null,null,null,null,null,null,null,null,null,null,null,null,null,null,null,null,null,null,null,null,null,null,null,null,null,null,null,null,">",null,null,null,null,null,null,null,null,null,null,null,null,null,null,null,null,null,null,null,null,null,null,null,null,null,null,null,null,null,null,null,">",null,null,null,null,null,null,null,null,null,null,null,null,null,null,null,null,null,null,null,null,null,null,null,null,null,null,null,null,null,null,null,">",null,null,null,null,null,null,null,null,null,null,null,null,null,null,null,null,null,null,null,null,null,null,null,null,null,null,null,null,null,null,null,">",{"$f":"IF(COUNTA(U11:FW11)>5,\"OK\",\"N/E\")","v":"N/E"}]
[null,0,{"$f":"IF(FX12=\"OK\",N12,0)","v":0},false,null,null,0,0,0,0,null,null,"CO6.2. Décrire le fonctionnement et/ou l’exploitation d’un système en utilisant l'outil de description le plus pertinent",3,null,null,null,null,null,null,null,null,null,null,null,null,null,null,null,null,null,null,null,null,null,null,null,null,null,null,null,null,null,null,null,null,null,null,null,null,">",null,null,null,null,null,null,null,null,null,null,null,null,null,null,null,null,null,null,null,null,null,null,null,null,null,null,null,null,null,null,null,">",null,null,null,null,null,null,null,null,null,null,null,null,null,null,null,null,null,null,null,null,null,null,null,null,null,null,null,null,null,null,null,">",null,null,null,null,null,null,null,null,null,null,null,null,null,null,null,null,null,null,null,null,null,null,null,null,null,null,null,null,null,null,null,">",null,null,null,null,null,null,null,null,null,null,null,null,null,null,null,null,null,null,null,null,null,null,null,null,null,null,null,null,null,null,null,">",{"$f":"IF(COUNTA(U12:FW12)>5,\"OK\",\"N/E\")","v":"N/E"}]
[null,0,{"$f":"IF(FX13=\"OK\",N13,0)","v":0},false,null,null,0,0,0,0,null,null,"CO6.3. Présenter et argumenter des démarches, des résultats, y compris dans une langue étrangère",5,null,null,null,null,null,null,null,null,null,null,null,null,null,null,null,null,null,null,null,null,null,null,null,null,null,null,null,null,null,null,null,null,null,null,null,null,">",null,null,null,null,null,null,null,null,null,null,null,null,null,null,null,null,null,null,null,null,null,null,null,null,null,null,null,null,null,null,null,">",null,null,null,null,null,null,null,null,null,null,null,null,null,null,null,null,null,null,null,null,null,null,null,null,null,null,null,null,null,null,null,">",null,null,null,null,null,null,null,null,null,null,null,null,null,null,null,null,null,null,null,null,null,null,null,null,null,null,null,null,null,null,null,">",null,null,null,null,null,null,null,null,null,null,null,null,null,null,null,null,null,null,null,null,null,null,null,null,null,null,null,null,null,null,null,">",{"$f":"IF(COUNTA(U13:FW13)>5,\"OK\",\"N/E\")","v":"N/E"}]
[null,null,null,false,null,null,null,null,null,null,null,null,"O7 -  Imaginer une solution, répondre à un besoin"]
[null,0,{"$f":"IF(OR(CE15=\"OK\",EQ15=\"OK\"),N15,0)","v":0},{"$f":"IF($B$1=3,TRUE,FALSE)","v":false},null,null,0,0,0,0,null,null,"CO7.ac1. Participer à une étude architecturale, dans une démarche de développement durable",5,null,null,null,null,null,null,null,null,null,null,null,null,null,null,null,null,null,null,null,null,null,null,null,null,null,null,null,null,null,null,null,null,null,null,null,null,{"$f":"IF(AND(AY$1<>\"\",COUNTA(U15:AX15)>0),\"OK\",\"N/E\")","v":"N/E"},null,null,null,null,null,null,null,null,null,null,null,null,null,null,null,null,null,null,null,null,null,null,null,null,null,null,null,null,null,null,null,{"$f":"IF(AND(CE$1<>\"\",COUNTA(U15:CD15)>1),\"OK\",\"N/E\")","v":"N/E"},null,null,null,null,null,null,null,null,null,null,null,null,null,null,null,null,null,null,null,null,null,null,null,null,null,null,null,null,null,null,null,{"$f":"IF(AND(DK$1<>\"\",COUNTA(U15:DJ15)>2),\"OK\",\"N/E\")","v":"N/E"},null,null,null,null,null,null,null,null,null,null,null,null,null,null,null,null,null,null,null,null,null,null,null,null,null,null,null,null,null,null,null,{"$f":"IF(AND(EQ$1<>\"\",COUNTA(U15:EP15)>3),\"OK\",\"N/E\")","v":"N/E"},null,null,null,null,null,null,null,null,null,null,null,null,null,null,null,null,null,null,null,null,null,null,null,null,null,null,null,null,null,null,null,{"$f":"IF(AND(FW$1<>\"\",COUNTA(U15:FV15)>4),\"OK\",\"N/E\")","v":"N/E"}]
[null,0,0,{"$f":"IF($B$1=3,TRUE,FALSE)","v":false},null,null,0,0,0,0,null,null,"CO7.ac2. Proposer/choisir des solutions techniques répondant aux contraintes et attentes d’une construction",7,null,null,null,null,null,null,null,null,null,null,null,null,null,null,null,null,null,null,null,null,null,null,null,null,null,null,null,null,null,null,null,null,null,null,null,null,{"$f":"IF(AND(AY$1<>\"\",COUNTA(U16:AX16)>0),\"OK\",\"N/E\")","v":"N/E"},null,null,null,null,null,null,null,null,null,null,null,null,null,null,null,null,null,null,null,null,null,null,null,null,null,null,null,null,null,null,null,{"$f":"IF(AND(CE$1<>\"\",COUNTA(U16:CD16)>1),\"OK\",\"N/E\")","v":"N/E"},null,null,null,null,null,null,null,null,null,null,null,null,null,null,null,null,null,null,null,null,null,null,null,null,null,null,null,null,null,null,null,{"$f":"IF(AND(DK$1<>\"\",COUNTA(U16:DJ16)>2),\"OK\",\"N/E\")","v":"N/E"},null,null,null,null,null,null,null,null,null,null,null,null,null,null,null,null,null,null,null,null,null,null,null,null,null,null,null,null,null,null,null,{"$f":"IF(AND(EQ$1<>\"\",COUNTA(U16:EP16)>3),\"OK\",\"N/E\")","v":"N/E"},null,null,null,null,null,null,null,null,null,null,null,null,null,null,null,null,null,null,null,null,null,null,null,null,null,null,null,null,null,null,null,{"$f":"IF(AND(FW$1<>\"\",COUNTA(U16:FV16)>4),\"OK\",\"N/E\")","v":"N/E"}]
[null,0,0,{"$f":"IF($B$1=3,TRUE,FALSE)","v":false},null,null,0,0,0,0,null,null,"CO7.ac3. Concevoir une organisation de réalisation",4,null,null,null,null,null,null,null,null,null,null,null,null,null,null,null,null,null,null,null,null,null,null,null,null,null,null,null,null,null,null,null,null,null,null,null,null,"N/E",null,null,null,null,null,null,null,null,null,null,null,null,null,null,null,null,null,null,null,null,null,null,null,null,null,null,null,null,null,null,null,"N/E",null,null,null,null,null,null,null,null,null,null,null,null,null,null,null,null,null,null,null,null,null,null,null,null,null,null,null,null,null,null,null,"N/E",null,null,null,null,null,null,null,null,null,null,null,null,null,null,null,null,null,null,null,null,null,null,null,null,null,null,null,null,null,null,null,"N/E",null,null,null,null,null,null,null,null,null,null,null,null,null,null,null,null,null,null,null,null,null,null,null,null,null,null,null,null,null,null,null,"N/E"]
[null,0,0,{"$f":"IF($B$1=4,TRUE,FALSE)","v":false},null,null,0,0,0,0,null,null,"CO7.ee1. Participer à une démarche de conception dans le but de proposer plusieurs solutions possibles à un problème technique identifié en lien avec un enjeu énergétique",7,null,null,null,null,null,null,null,null,null,null,null,null,null,null,null,null,null,null,null,null,null,null,null,null,null,null,null,null,null,null,null,null,null,null,null,null,"N/E",null,null,null,null,null,null,null,null,null,null,null,null,null,null,null,null,null,null,null,null,null,null,null,null,null,null,null,null,null,null,null,"N/E",null,null,null,null,null,null,null,null,null,null,null,null,null,null,null,null,null,null,null,null,null,null,null,null,null,null,null,null,null,null,null,"N/E",null,null,null,null,null,null,null,null,null,null,null,null,null,null,null,null,null,null,null,null,null,null,null,null,null,null,null,null,null,null,null,"N/E",null,null,null,null,null,null,null,null,null,null,null,null,null,null,null,null,null,null,null,null,null,null,null,null,null,null,null,null,null,null,null,"N/E"]
[null,0,0,{"$f":"IF($B$1=4,TRUE,FALSE)","v":false},null,null,0,0,0,0,null,null,"CO7.ee2. Justifier une solution retenue en intégrant les conséquences des choix sur le triptyque matériau-énergie-information",6,null,null,null,null,null,null,null,null,null,null,null,null,null,null,null,null,null,null,null,null,null,null,null,null,null,null,null,null,null,null,null,null,null,null,null,null,"N/E",null,null,null,null,null,null,null,null,null,null,null,null,null,null,null,null,null,null,null,null,null,null,null,null,null,null,null,null,null,null,null,"N/E",null,null,null,null,null,null,null,null,null,null,null,null,null,null,null,null,null,null,null,null,null,null,null,null,null,null,null,null,null,null,null,"N/E",null,null,null,null,null,null,null,null,null,null,null,null,null,null,null,null,null,null,null,null,null,null,null,null,null,null,null,null,null,null,null,"N/E",null,null,null,null,null,null,null,null,null,null,null,null,null,null,null,null,null,null,null,null,null,null,null,null,null,null,null,null,null,null,null,"N/E"]
[null,0,0,{"$f":"IF($B$1=4,TRUE,FALSE)","v":false},null,null,0,0,0,0,null,null,"CO7.ee3. Définir la structure, la constitution d’un système en fonction des caractéristiques technico-économiques et environnementales attendues",4,null,null,null,null,null,null,null,null,null,null,null,null,null,null,null,null,null,null,null,null,null,null,null,null,null,null,null,null,null,null,null,null,null,null,null,null,"N/E",null,null,null,null,null,null,null,null,null,null,null,null,null,null,null,null,null,null,null,null,null,null,null,null,null,null,null,null,null,null,null,"N/E",null,null,null,null,null,null,null,null,null,null,null,null,null,null,null,null,null,null,null,null,null,null,null,null,null,null,null,null,null,null,null,"N/E",null,null,null,null,null,null,null,null,null,null,null,null,null,null,null,null,null,null,null,null,null,null,null,null,null,null,null,null,null,null,null,"N/E",null,null,null,null,null,null,null,null,null,null,null,null,null,null,null,null,null,null,null,null,null,null,null,null,null,null,null,null,null,null,null,"N/E"]
[null,0,0,{"$f":"IF($B$1=4,TRUE,FALSE)","v":false},null,null,0,0,0,0,null,null,"CO7.ee4. Définir les modifications de la structure, les choix de constituants et du type de système de gestion d'une chaîne d’énergie afin de répondre à une évolution d’un cahier des charges",4,null,null,null,null,null,null,null,null,null,null,null,null,null,null,null,null,null,null,null,null,null,null,null,null,null,null,null,null,null,null,null,null,null,null,null,null,"N/E",null,null,null,null,null,null,null,null,null,null,null,null,null,null,null,null,null,null,null,null,null,null,null,null,null,null,null,null,null,null,null,"N/E",null,null,null,null,null,null,null,null,null,null,null,null,null,null,null,null,null,null,null,null,null,null,null,null,null,null,null,null,null,null,null,"N/E",null,null,null,null,null,null,null,null,null,null,null,null,null,null,null,null,null,null,null,null,null,null,null,null,null,null,null,null,null,null,null,"N/E",null,null,null,null,null,null,null,null,null,null,null,null,null,null,null,null,null,null,null,null,null,null,null,null,null,null,null,null,null,null,null,"N/E"]
[null,0,0,{"$f":"IF($B$1=5,TRUE,FALSE)","v":false},null,null,0,0,0,0,null,null,"CO7.itec1. Identifier et justifier un problème technique à partir de l’analyse globale d’un système (approche matière-énergie-information)",5,null,null,null,null,null,null,null,null,null,null,null,null,null,null,null,null,null,null,null,null,null,null,null,null,null,null,null,null,null,null,null,null,null,null,null,null,"N/E",null,null,null,null,null,null,null,null,null,null,null,null,null,null,null,null,null,null,null,null,null,null,null,null,null,null,null,null,null,null,null,"N/E",null,null,null,null,null,null,null,null,null,null,null,null,null,null,null,null,null,null,null,null,null,null,null,null,null,null,null,null,null,null,null,"N/E",null,null,null,null,null,null,null,null,null,null,null,null,null,null,null,null,null,null,null,null,null,null,null,null,null,null,null,null,null,null,null,"N/E",null,null,null,null,null,null,null,null,null,null,null,null,null,null,null,null,null,null,null,null,null,null,null,null,null,null,null,null,null,null,null,"N/E"]
[null,0,0,{"$f":"IF($B$1=5,TRUE,FALSE)","v":false},null,null,0,0,0,0,null,null,"CO7.itec2. Proposer des solutions à un problème technique identifié en participant à des démarches de créativité, choisir et justifier la solution retenue",6,null,null,null,null,null,null,null,null,null,null,null,null,null,null,null,null,null,null,null,null,null,null,null,null,null,null,null,null,null,null,null,null,null,null,null,null,"N/E",null,null,null,null,null,null,null,null,null,null,null,null,null,null,null,null,null,null,null,null,null,null,null,null,null,null,null,null,null,null,null,"N/E",null,null,null,null,null,null,null,null,null,null,null,null,null,null,null,null,null,null,null,null,null,null,null,null,null,null,null,null,null,null,null,"N/E",null,null,null,null,null,null,null,null,null,null,null,null,null,null,null,null,null,null,null,null,null,null,null,null,null,null,null,null,null,null,null,"N/E",null,null,null,null,null,null,null,null,null,null,null,null,null,null,null,null,null,null,null,null,null,null,null,null,null,null,null,null,null,null,null,"N/E"]
[null,0,0,{"$f":"IF($B$1=5,TRUE,FALSE)","v":false},null,null,0,0,0,0,null,null,"CO7.itec3. Définir, à l’aide d’un modeleur numérique, les formes et dimensions d'une pièce d'un mécanisme à partir des contraintes fonctionnelles, de son principe de réalisation et de son matériau",3,null,null,null,null,null,null,null,null,null,null,null,null,null,null,null,null,null,null,null,null,null,null,null,null,null,null,null,null,null,null,null,null,null,null,null,null,"N/E",null,null,null,null,null,null,null,null,null,null,null,null,null,null,null,null,null,null,null,null,null,null,null,null,null,null,null,null,null,null,null,"N/E",null,null,null,null,null,null,null,null,null,null,null,null,null,null,null,null,null,null,null,null,null,null,null,null,null,null,null,null,null,null,null,"N/E",null,null,null,null,null,null,null,null,null,null,null,null,null,null,null,null,null,null,null,null,null,null,null,null,null,null,null,null,null,null,null,"N/E",null,null,null,null,null,null,null,null,null,null,null,null,null,null,null,null,null,null,null,null,null,null,null,null,null,null,null,null,null,null,null,"N/E"]
[null,0,0,{"$f":"IF($B$1=5,TRUE,FALSE)","v":false},null,null,0,0,0,0,null,null,"CO7.itec4. Définir, à l’aide d’un modeleur numérique, les modifications d'un mécanisme à partir des contraintes fonctionnelles",2,null,null,null,null,null,null,null,null,null,null,null,null,null,null,null,null,null,null,null,null,null,null,null,null,null,null,null,null,null,null,null,null,null,null,null,null,"N/E",null,null,null,null,null,null,null,null,null,null,null,null,null,null,null,null,null,null,null,null,null,null,null,null,null,null,null,null,null,null,null,"N/E",null,null,null,null,null,null,null,null,null,null,null,null,null,null,null,null,null,null,null,null,null,null,null,null,null,null,null,null,null,null,null,"N/E",null,null,null,null,null,null,null,null,null,null,null,null,null,null,null,null,null,null,null,null,null,null,null,null,null,null,null,null,null,null,null,"N/E",null,null,null,null,null,null,null,null,null,null,null,null,null,null,null,null,null,null,null,null,null,null,null,null,null,null,null,null,null,null,null,"N/E"]
[null,0,0,{"$f":"IF($B$1=6,TRUE,FALSE)","v":false},null,null,0,0,0,0,null,null,"CO7.sin1. Décoder la notice technique d’un système, vérifier la conformité du fonctionnement",4,null,null,null,null,null,null,null,null,null,null,null,null,null,null,null,null,null,null,null,null,null,null,null,null,null,null,null,null,null,null,null,null,null,null,null,null,"N/E",null,null,null,null,null,null,null,null,null,null,null,null,null,null,null,null,null,null,null,null,null,null,null,null,null,null,null,null,null,null,null,"N/E",null,null,null,null,null,null,null,null,null,null,null,null,null,null,null,null,null,null,null,null,null,null,null,null,null,null,null,null,null,null,null,"N/E",null,null,null,null,null,null,null,null,null,null,null,null,null,null,null,null,null,null,null,null,null,null,null,null,null,null,null,null,null,null,null,"N/E",null,null,null,null,null,null,null,null,null,null,null,null,null,null,null,null,null,null,null,null,null,null,null,null,null,null,null,null,null,null,null,"N/E"]
[null,0,0,{"$f":"IF($B$1=6,TRUE,FALSE)","v":false},null,null,0,0,0,0,null,null,"CO7.sin2. Décoder le cahier des charges fonctionnel décrivant le besoin exprimé, identifier la fonction définie par un besoin exprimé, faire des mesures pour caractériser cette fonction et conclure sur sa conformité",5,null,null,null,null,null,null,null,null,null,null,null,null,null,null,null,null,null,null,null,null,null,null,null,null,null,null,null,null,null,null,null,null,null,null,null,null,"N/E",null,null,null,null,null,null,null,null,null,null,null,null,null,null,null,null,null,null,null,null,null,null,null,null,null,null,null,null,null,null,null,"N/E",null,null,null,null,null,null,null,null,null,null,null,null,null,null,null,null,null,null,null,null,null,null,null,null,null,null,null,null,null,null,null,"N/E",null,null,null,null,null,null,null,null,null,null,null,null,null,null,null,null,null,null,null,null,null,null,null,null,null,null,null,null,null,null,null,"N/E",null,null,null,null,null,null,null,null,null,null,null,null,null,null,null,null,null,null,null,null,null,null,null,null,null,null,null,null,null,null,null,"N/E"]
[null,0,0,{"$f":"IF($B$1=6,TRUE,FALSE)","v":false},null,null,0,0,0,0,null,null,"CO7.sin3. Exprimer le principe de fonctionnement d’un système à partir des diagrammes SysML pertinents Repérer les constituants de la chaîne d’énergie et d’information",4,null,null,null,null,null,null,null,null,null,null,null,null,null,null,null,null,null,null,null,null,null,null,null,null,null,null,null,null,null,null,null,null,null,null,null,null,"N/E",null,null,null,null,null,null,null,null,null,null,null,null,null,null,null,null,null,null,null,null,null,null,null,null,null,null,null,null,null,null,null,"N/E",null,null,null,null,null,null,null,null,null,null,null,null,null,null,null,null,null,null,null,null,null,null,null,null,null,null,null,null,null,null,null,"N/E",null,null,null,null,null,null,null,null,null,null,null,null,null,null,null,null,null,null,null,null,null,null,null,null,null,null,null,null,null,null,null,"N/E",null,null,null,null,null,null,null,null,null,null,null,null,null,null,null,null,null,null,null,null,null,null,null,null,null,null,null,null,null,null,null,"N/E"]
[null,null,null,{"$f":"IF($B$1>2,TRUE,FALSE)","v":false},null,null,null,null,null,null,null,null,"O8 -Valider des solutions techniques"]
[null,0,{"$f":"IF(OR(CE30=\"OK\",EQ30=\"OK\"),N30,0)","v":0},{"$f":"IF($B$1=3,TRUE,FALSE)","v":false},null,null,0,0,0,0,null,null,"CO8.ac1. Simuler un comportement structurel, thermique et acoustique de tout ou partie d’une construction",4,null,null,null,null,null,null,null,null,null,null,null,null,null,null,null,null,null,null,null,null,null,null,null,null,null,null,null,null,null,null,null,null,null,null,null,null,{"$f":"IF(AND(AY$1<>\"\",COUNTA(U30:AX30)>0),\"OK\",\"N/E\")","v":"N/E"},null,null,null,null,null,null,null,null,null,null,null,null,null,null,null,null,null,null,null,null,null,null,null,null,null,null,null,null,null,null,null,{"$f":"IF(AND(CE$1<>\"\",COUNTA(U30:CD30)>1),\"OK\",\"N/E\")","v":"N/E"},null,null,null,null,null,null,null,null,null,null,null,null,null,null,null,null,null,null,null,null,null,null,null,null,null,null,null,null,null,null,null,{"$f":"IF(AND(DK$1<>\"\",COUNTA(U30:DJ30)>2),\"OK\",\"N/E\")","v":"N/E"},null,null,null,null,null,null,null,null,null,null,null,null,null,null,null,null,null,null,null,null,null,null,null,null,null,null,null,null,null,null,null,{"$f":"IF(AND(EQ$1<>\"\",COUNTA(U30:EP30)>3),\"OK\",\"N/E\")","v":"N/E"},null,null,null,null,null,null,null,null,null,null,null,null,null,null,null,null,null,null,null,null,null,null,null,null,null,null,null,null,null,null,null,{"$f":"IF(AND(FW$1<>\"\",COUNTA(U30:FV30)>4),\"OK\",\"N/E\")","v":"N/E"}]
[null,0,0,{"$f":"IF($B$1=3,TRUE,FALSE)","v":false},null,null,0,0,0,0,null,null,"CO8.ac2. Analyser les résultats issus de simulations ou d’essais de laboratoire",4,null,null,null,null,null,null,null,null,null,null,null,null,null,null,null,null,null,null,null,null,null,null,null,null,null,null,null,null,null,null,null,null,null,null,null,null,"N/E",null,null,null,null,null,null,null,null,null,null,null,null,null,null,null,null,null,null,null,null,null,null,null,null,null,null,null,null,null,null,null,"N/E",null,null,null,null,null,null,null,null,null,null,null,null,null,null,null,null,null,null,null,null,null,null,null,null,null,null,null,null,null,null,null,"N/E",null,null,null,null,null,null,null,null,null,null,null,null,null,null,null,null,null,null,null,null,null,null,null,null,null,null,null,null,null,null,null,"N/E",null,null,null,null,null,null,null,null,null,null,null,null,null,null,null,null,null,null,null,null,null,null,null,null,null,null,null,null,null,null,null,"N/E"]
[null,0,0,{"$f":"IF($B$1=3,TRUE,FALSE)","v":false},null,null,0,0,0,0,null,null,"CO8.ac3. Analyser/valider les choix structurels et de confort",4,null,null,null,null,null,null,null,null,null,null,null,null,null,null,null,null,null,null,null,null,null,null,null,null,null,null,null,null,null,null,null,null,null,null,null,null,"N/E",null,null,null,null,null,null,null,null,null,null,null,null,null,null,null,null,null,null,null,null,null,null,null,null,null,null,null,null,null,null,null,"N/E",null,null,null,null,null,null,null,null,null,null,null,null,null,null,null,null,null,null,null,null,null,null,null,null,null,null,null,null,null,null,null,"N/E",null,null,null,null,null,null,null,null,null,null,null,null,null,null,null,null,null,null,null,null,null,null,null,null,null,null,null,null,null,null,null,"N/E",null,null,null,null,null,null,null,null,null,null,null,null,null,null,null,null,null,null,null,null,null,null,null,null,null,null,null,null,null,null,null,"N/E"]
[null,0,0,{"$f":"IF($B$1=4,TRUE,FALSE)","v":false},null,null,0,0,0,0,null,null,"CO8.ee1. Renseigner un logiciel de simulation du comportement énergétique avec les caractéristiques du système et les paramètres externes pour un point de fonctionnement donné",3,null,null,null,null,null,null,null,null,null,null,null,null,null,null,null,null,null,null,null,null,null,null,null,null,null,null,null,null,null,null,null,null,null,null,null,null,"N/E",null,null,null,null,null,null,null,null,null,null,null,null,null,null,null,null,null,null,null,null,null,null,null,null,null,null,null,null,null,null,null,"N/E",null,null,null,null,null,null,null,null,null,null,null,null,null,null,null,null,null,null,null,null,null,null,null,null,null,null,null,null,null,null,null,"N/E",null,null,null,null,null,null,null,null,null,null,null,null,null,null,null,null,null,null,null,null,null,null,null,null,null,null,null,null,null,null,null,"N/E",null,null,null,null,null,null,null,null,null,null,null,null,null,null,null,null,null,null,null,null,null,null,null,null,null,null,null,null,null,null,null,"N/E"]
[null,0,0,{"$f":"IF($B$1=4,TRUE,FALSE)","v":false},null,null,0,0,0,0,null,null,"CO8.ee2. Interpréter les résultats d'une simulation afin de valider une solution ou l’optimiser",4,null,null,null,null,null,null,null,null,null,null,null,null,null,null,null,null,null,null,null,null,null,null,null,null,null,null,null,null,null,null,null,null,null,null,null,null,"N/E",null,null,null,null,null,null,null,null,null,null,null,null,null,null,null,null,null,null,null,null,null,null,null,null,null,null,null,null,null,null,null,"N/E",null,null,null,null,null,null,null,null,null,null,null,null,null,null,null,null,null,null,null,null,null,null,null,null,null,null,null,null,null,null,null,"N/E",null,null,null,null,null,null,null,null,null,null,null,null,null,null,null,null,null,null,null,null,null,null,null,null,null,null,null,null,null,null,null,"N/E",null,null,null,null,null,null,null,null,null,null,null,null,null,null,null,null,null,null,null,null,null,null,null,null,null,null,null,null,null,null,null,"N/E"]
[null,0,0,{"$f":"IF($B$1=4,TRUE,FALSE)","v":false},null,null,0,0,0,0,null,null,"CO8.ee3. Comparer et interpréter le résultat d'une simulation d'un comportement d’un système avec un comportement réel",3,null,null,null,null,null,null,null,null,null,null,null,null,null,null,null,null,null,null,null,null,null,null,null,null,null,null,null,null,null,null,null,null,null,null,null,null,"N/E",null,null,null,null,null,null,null,null,null,null,null,null,null,null,null,null,null,null,null,null,null,null,null,null,null,null,null,null,null,null,null,"N/E",null,null,null,null,null,null,null,null,null,null,null,null,null,null,null,null,null,null,null,null,null,null,null,null,null,null,null,null,null,null,null,"N/E",null,null,null,null,null,null,null,null,null,null,null,null,null,null,null,null,null,null,null,null,null,null,null,null,null,null,null,null,null,null,null,"N/E",null,null,null,null,null,null,null,null,null,null,null,null,null,null,null,null,null,null,null,null,null,null,null,null,null,null,null,null,null,null,null,"N/E"]
[null,0,0,{"$f":"IF($B$1=4,TRUE,FALSE)","v":false},null,null,0,0,0,0,null,null,"CO8.ee4. Mettre en oeuvre un protocole d’essais et de mesures sur le prototype d’une chaîne d’énergie, interpréter les résultats",5,null,null,null,null,null,null,null,null,null,null,null,null,null,null,null,null,null,null,null,null,null,null,null,null,null,null,null,null,null,null,null,null,null,null,null,null,"N/E",null,null,null,null,null,null,null,null,null,null,null,null,null,null,null,null,null,null,null,null,null,null,null,null,null,null,null,null,null,null,null,"N/E",null,null,null,null,null,null,null,null,null,null,null,null,null,null,null,null,null,null,null,null,null,null,null,null,null,null,null,null,null,null,null,"N/E",null,null,null,null,null,null,null,null,null,null,null,null,null,null,null,null,null,null,null,null,null,null,null,null,null,null,null,null,null,null,null,"N/E",null,null,null,null,null,null,null,null,null,null,null,null,null,null,null,null,null,null,null,null,null,null,null,null,null,null,null,null,null,null,null,"N/E"]
[null,0,0,{"$f":"IF($B$1=5,TRUE,FALSE)","v":false},null,null,0,0,0,0,null,null,"CO8.itec1. Paramétrer un logiciel de simulation mécanique pour obtenir les caractéristiques d'une loi d'entrée/sortie d'un mécanisme simple",3,null,null,null,null,null,null,null,null,null,null,null,null,null,null,null,null,null,null,null,null,null,null,null,null,null,null,null,null,null,null,null,null,null,null,null,null,"N/E",null,null,null,null,null,null,null,null,null,null,null,null,null,null,null,null,null,null,null,null,null,null,null,null,null,null,null,null,null,null,null,"N/E",null,null,null,null,null,null,null,null,null,null,null,null,null,null,null,null,null,null,null,null,null,null,null,null,null,null,null,null,null,null,null,"N/E",null,null,null,null,null,null,null,null,null,null,null,null,null,null,null,null,null,null,null,null,null,null,null,null,null,null,null,null,null,null,null,"N/E",null,null,null,null,null,null,null,null,null,null,null,null,null,null,null,null,null,null,null,null,null,null,null,null,null,null,null,null,null,null,null,"N/E"]
[null,0,0,{"$f":"IF($B$1=5,TRUE,FALSE)","v":false},null,null,0,0,0,0,null,null,"CO8.itec2. Interpréter les résultats d'une simulation mécanique pour valider une solution ou modifier une pièce ou un mécanisme",4,null,null,null,null,null,null,null,null,null,null,null,null,null,null,null,null,null,null,null,null,null,null,null,null,null,null,null,null,null,null,null,null,null,null,null,null,"N/E",null,null,null,null,null,null,null,null,null,null,null,null,null,null,null,null,null,null,null,null,null,null,null,null,null,null,null,null,null,null,null,"N/E",null,null,null,null,null,null,null,null,null,null,null,null,null,null,null,null,null,null,null,null,null,null,null,null,null,null,null,null,null,null,null,"N/E",null,null,null,null,null,null,null,null,null,null,null,null,null,null,null,null,null,null,null,null,null,null,null,null,null,null,null,null,null,null,null,"N/E",null,null,null,null,null,null,null,null,null,null,null,null,null,null,null,null,null,null,null,null,null,null,null,null,null,null,null,null,null,null,null,"N/E"]
[null,0,0,{"$f":"IF($B$1=5,TRUE,FALSE)","v":false},null,null,0,0,0,0,null,null,"CO8.itec3. Mettre en oeuvre un protocole d’essais et de mesures, interpréter les résultats",5,null,null,null,null,null,null,null,null,null,null,null,null,null,null,null,null,null,null,null,null,null,null,null,null,null,null,null,null,null,null,null,null,null,null,null,null,"N/E",null,null,null,null,null,null,null,null,null,null,null,null,null,null,null,null,null,null,null,null,null,null,null,null,null,null,null,null,null,null,null,"N/E",null,null,null,null,null,null,null,null,null,null,null,null,null,null,null,null,null,null,null,null,null,null,null,null,null,null,null,null,null,null,null,"N/E",null,null,null,null,null,null,null,null,null,null,null,null,null,null,null,null,null,null,null,null,null,null,null,null,null,null,null,null,null,null,null,"N/E",null,null,null,null,null,null,null,null,null,null,null,null,null,null,null,null,null,null,null,null,null,null,null,null,null,null,null,null,null,null,null,"N/E"]
[null,0,0,{"$f":"IF($B$1=5,TRUE,FALSE)","v":false},null,null,0,0,0,0,null,null,"CO8.itec4. Comparer et interpréter le résultat d'une simulation d'un comportement mécanique avec un comportement réel",3,null,null,null,null,null,null,null,null,null,null,null,null,null,null,null,null,null,null,null,null,null,null,null,null,null,null,null,null,null,null,null,null,null,null,null,null,"N/E",null,null,null,null,null,null,null,null,null,null,null,null,null,null,null,null,null,null,null,null,null,null,null,null,null,null,null,null,null,null,null,"N/E",null,null,null,null,null,null,null,null,null,null,null,null,null,null,null,null,null,null,null,null,null,null,null,null,null,null,null,null,null,null,null,"N/E",null,null,null,null,null,null,null,null,null,null,null,null,null,null,null,null,null,null,null,null,null,null,null,null,null,null,null,null,null,null,null,"N/E",null,null,null,null,null,null,null,null,null,null,null,null,null,null,null,null,null,null,null,null,null,null,null,null,null,null,null,null,null,null,null,"N/E"]
[null,0,0,{"$f":"IF($B$1=6,TRUE,FALSE)","v":false},null,null,0,0,0,0,null,null,"CO8.sin1. Rechercher et choisir une solution logicielle ou matérielle au regard de la définition d'un système",3,null,null,null,null,null,null,null,null,null,null,null,null,null,null,null,null,null,null,null,null,null,null,null,null,null,null,null,null,null,null,null,null,null,null,null,null,"N/E",null,null,null,null,null,null,null,null,null,null,null,null,null,null,null,null,null,null,null,null,null,null,null,null,null,null,null,null,null,null,null,"N/E",null,null,null,null,null,null,null,null,null,null,null,null,null,null,null,null,null,null,null,null,null,null,null,null,null,null,null,null,null,null,null,"N/E",null,null,null,null,null,null,null,null,null,null,null,null,null,null,null,null,null,null,null,null,null,null,null,null,null,null,null,null,null,null,null,"N/E",null,null,null,null,null,null,null,null,null,null,null,null,null,null,null,null,null,null,null,null,null,null,null,null,null,null,null,null,null,null,null,"N/E"]
[null,0,0,{"$f":"IF($B$1=6,TRUE,FALSE)","v":false},null,null,0,0,0,0,null,null,"CO8.sin2. Établir pour une fonction précédemment identifiée un modèle de comportement à partir de mesures faites sur le système",4,null,null,null,null,null,null,null,null,null,null,null,null,null,null,null,null,null,null,null,null,null,null,null,null,null,null,null,null,null,null,null,null,null,null,null,null,"N/E",null,null,null,null,null,null,null,null,null,null,null,null,null,null,null,null,null,null,null,null,null,null,null,null,null,null,null,null,null,null,null,"N/E",null,null,null,null,null,null,null,null,null,null,null,null,null,null,null,null,null,null,null,null,null,null,null,null,null,null,null,null,null,null,null,"N/E",null,null,null,null,null,null,null,null,null,null,null,null,null,null,null,null,null,null,null,null,null,null,null,null,null,null,null,null,null,null,null,"N/E",null,null,null,null,null,null,null,null,null,null,null,null,null,null,null,null,null,null,null,null,null,null,null,null,null,null,null,null,null,null,null,"N/E"]
[null,0,0,{"$f":"IF($B$1=6,TRUE,FALSE)","v":false},null,null,0,0,0,0,null,null,"CO8.sin3. Traduire sous forme graphique l’architecture de la chaîne d’information identifiée pour un système et définir les paramètres d’utilisation du simulateur",3,null,null,null,null,null,null,null,null,null,null,null,null,null,null,null,null,null,null,null,null,null,null,null,null,null,null,null,null,null,null,null,null,null,null,null,null,"N/E",null,null,null,null,null,null,null,null,null,null,null,null,null,null,null,null,null,null,null,null,null,null,null,null,null,null,null,null,null,null,null,"N/E",null,null,null,null,null,null,null,null,null,null,null,null,null,null,null,null,null,null,null,null,null,null,null,null,null,null,null,null,null,null,null,"N/E",null,null,null,null,null,null,null,null,null,null,null,null,null,null,null,null,null,null,null,null,null,null,null,null,null,null,null,null,null,null,null,"N/E",null,null,null,null,null,null,null,null,null,null,null,null,null,null,null,null,null,null,null,null,null,null,null,null,null,null,null,null,null,null,null,"N/E"]
[null,0,0,{"$f":"IF($B$1=6,TRUE,FALSE)","v":false},null,null,0,0,0,0,null,null,"CO8.sin4. Identifier les variables simulées et mesurées sur un système pour valider le choix d’une solution",4,null,null,null,null,null,null,null,null,null,null,null,null,null,null,null,null,null,null,null,null,null,null,null,null,null,null,null,null,null,null,null,null,null,null,null,null,"N/E",null,null,null,null,null,null,null,null,null,null,null,null,null,null,null,null,null,null,null,null,null,null,null,null,null,null,null,null,null,null,null,"N/E",null,null,null,null,null,null,null,null,null,null,null,null,null,null,null,null,null,null,null,null,null,null,null,null,null,null,null,null,null,null,null,"N/E",null,null,null,null,null,null,null,null,null,null,null,null,null,null,null,null,null,null,null,null,null,null,null,null,null,null,null,null,null,null,null,"N/E",null,null,null,null,null,null,null,null,null,null,null,null,null,null,null,null,null,null,null,null,null,null,null,null,null,null,null,null,null,null,null,"N/E"]
[null,0,{"$f":"IF(FX45=\"OK\",N45,0)","v":0},{"$f":"IF($B$1>2,TRUE,FALSE)","v":false},null,null,0,0,0,0,null,null,"CO8.es Justifier des éléments d'une simulation relative au comportement de tout ou partie d'un système et les écarts par rapport au réel",5,null,null,null,null,null,null,null,null,null,null,null,null,null,null,null,null,null,null,null,null,null,null,null,null,null,null,null,null,null,null,null,null,null,null,null,null,">",null,null,null,null,null,null,null,null,null,null,null,null,null,null,null,null,null,null,null,null,null,null,null,null,null,null,null,null,null,null,null,">",null,null,null,null,null,null,null,null,null,null,null,null,null,null,null,null,null,null,null,null,null,null,null,null,null,null,null,null,null,null,null,">",null,null,null,null,null,null,null,null,null,null,null,null,null,null,null,null,null,null,null,null,null,null,null,null,null,null,null,null,null,null,null,">",null,null,null,null,null,null,null,null,null,null,null,null,null,null,null,null,null,null,null,null,null,null,null,null,null,null,null,null,null,null,null,">",{"$f":"IF(COUNTA(U45:FW45)>5,\"OK\",\"N/E\")","v":"N/E"}]
[null,null,null,{"$f":"IF($B$1>2,TRUE,FALSE)","v":false},null,null,null,null,null,null,null,null,"O9 – Gérer la vie du produit"]
[null,0,{"$f":"IF(OR(CE47=\"OK\",EQ47=\"OK\"),N47,0)","v":0},{"$f":"IF($B$1=3,TRUE,FALSE)","v":false},null,null,0,0,0,0,null,null,"CO9.ac1. Améliorer les performances d’une construction du point de vue énergétique, domotique et informationnel",5,null,null,null,null,null,null,null,null,null,null,null,null,null,null,null,null,null,null,null,null,null,null,null,null,null,null,null,null,null,null,null,null,null,null,null,null,{"$f":"IF(AND(AY$1<>\"\",COUNTA(U47:AX47)>0),\"OK\",\"N/E\")","v":"N/E"},null,null,null,null,null,null,null,null,null,null,null,null,null,null,null,null,null,null,null,null,null,null,null,null,null,null,null,null,null,null,null,{"$f":"IF(AND(CE$1<>\"\",COUNTA(U47:CD47)>1),\"OK\",\"N/E\")","v":"N/E"},null,null,null,null,null,null,null,null,null,null,null,null,null,null,null,null,null,null,null,null,null,null,null,null,null,null,null,null,null,null,null,{"$f":"IF(AND(DK$1<>\"\",COUNTA(U47:DJ47)>2),\"OK\",\"N/E\")","v":"N/E"},null,null,null,null,null,null,null,null,null,null,null,null,null,null,null,null,null,null,null,null,null,null,null,null,null,null,null,null,null,null,null,{"$f":"IF(AND(EQ$1<>\"\",COUNTA(U47:EP47)>3),\"OK\",\"N/E\")","v":"N/E"},null,null,null,null,null,null,null,null,null,null,null,null,null,null,null,null,null,null,null,null,null,null,null,null,null,null,null,null,null,null,null,{"$f":"IF(AND(FW$1<>\"\",COUNTA(U47:FV47)>4),\"OK\",\"N/E\")","v":"N/E"}]
[null,0,0,{"$f":"IF($B$1=3,TRUE,FALSE)","v":false},null,null,0,0,0,0,null,null,"CO9.ac2. Identifier et décrire les causes de désordre dans une construction",3,null,null,null,null,null,null,null,null,null,null,null,null,null,null,null,null,null,null,null,null,null,null,null,null,null,null,null,null,null,null,null,null,null,null,null,null,"N/E",null,null,null,null,null,null,null,null,null,null,null,null,null,null,null,null,null,null,null,null,null,null,null,null,null,null,null,null,null,null,null,"N/E",null,null,null,null,null,null,null,null,null,null,null,null,null,null,null,null,null,null,null,null,null,null,null,null,null,null,null,null,null,null,null,"N/E",null,null,null,null,null,null,null,null,null,null,null,null,null,null,null,null,null,null,null,null,null,null,null,null,null,null,null,null,null,null,null,"N/E",null,null,null,null,null,null,null,null,null,null,null,null,null,null,null,null,null,null,null,null,null,null,null,null,null,null,null,null,null,null,null,"N/E"]
[null,0,0,{"$f":"IF($B$1=3,TRUE,FALSE)","v":false},null,null,0,0,0,0,null,null,"CO9.ac3. Valoriser la fin de vie du produit : déconstruction, gestion des déchets, valorisation des produits",3,null,null,null,null,null,null,null,null,null,null,null,null,null,null,null,null,null,null,null,null,null,null,null,null,null,null,null,null,null,null,null,null,null,null,null,null,"N/E",null,null,null,null,null,null,null,null,null,null,null,null,null,null,null,null,null,null,null,null,null,null,null,null,null,null,null,null,null,null,null,"N/E",null,null,null,null,null,null,null,null,null,null,null,null,null,null,null,null,null,null,null,null,null,null,null,null,null,null,null,null,null,null,null,"N/E",null,null,null,null,null,null,null,null,null,null,null,null,null,null,null,null,null,null,null,null,null,null,null,null,null,null,null,null,null,null,null,"N/E",null,null,null,null,null,null,null,null,null,null,null,null,null,null,null,null,null,null,null,null,null,null,null,null,null,null,null,null,null,null,null,"N/E"]
[null,0,0,{"$f":"IF($B$1=4,TRUE,FALSE)","v":false},null,null,0,0,0,0,null,null,"CO9.ee1. Expérimenter des procédés de stockage, de production, de transport, de transformation, d’énergie pour aider à la conception d’une chaîne d’énergie",3,null,null,null,null,null,null,null,null,null,null,null,null,null,null,null,null,null,null,null,null,null,null,null,null,null,null,null,null,null,null,null,null,null,null,null,null,"N/E",null,null,null,null,null,null,null,null,null,null,null,null,null,null,null,null,null,null,null,null,null,null,null,null,null,null,null,null,null,null,null,"N/E",null,null,null,null,null,null,null,null,null,null,null,null,null,null,null,null,null,null,null,null,null,null,null,null,null,null,null,null,null,null,null,"N/E",null,null,null,null,null,null,null,null,null,null,null,null,null,null,null,null,null,null,null,null,null,null,null,null,null,null,null,null,null,null,null,"N/E",null,null,null,null,null,null,null,null,null,null,null,null,null,null,null,null,null,null,null,null,null,null,null,null,null,null,null,null,null,null,null,"N/E"]
[null,0,0,{"$f":"IF($B$1=4,TRUE,FALSE)","v":false},null,null,0,0,0,0,null,null,"CO9.ee2. Réaliser et valider un prototype obtenu en réponse à tout ou partie du cahier des charges initial",4,null,null,null,null,null,null,null,null,null,null,null,null,null,null,null,null,null,null,null,null,null,null,null,null,null,null,null,null,null,null,null,null,null,null,null,null,"N/E",null,null,null,null,null,null,null,null,null,null,null,null,null,null,null,null,null,null,null,null,null,null,null,null,null,null,null,null,null,null,null,"N/E",null,null,null,null,null,null,null,null,null,null,null,null,null,null,null,null,null,null,null,null,null,null,null,null,null,null,null,null,null,null,null,"N/E",null,null,null,null,null,null,null,null,null,null,null,null,null,null,null,null,null,null,null,null,null,null,null,null,null,null,null,null,null,null,null,"N/E",null,null,null,null,null,null,null,null,null,null,null,null,null,null,null,null,null,null,null,null,null,null,null,null,null,null,null,null,null,null,null,"N/E"]
[null,0,0,{"$f":"IF($B$1=4,TRUE,FALSE)","v":false},null,null,0,0,0,0,null,null,"CO9.ee3. Intégrer un prototype dans un système à modifier pour valider son comportement et ses performances",4,null,null,null,null,null,null,null,null,null,null,null,null,null,null,null,null,null,null,null,null,null,null,null,null,null,null,null,null,null,null,null,null,null,null,null,null,"N/E",null,null,null,null,null,null,null,null,null,null,null,null,null,null,null,null,null,null,null,null,null,null,null,null,null,null,null,null,null,null,null,"N/E",null,null,null,null,null,null,null,null,null,null,null,null,null,null,null,null,null,null,null,null,null,null,null,null,null,null,null,null,null,null,null,"N/E",null,null,null,null,null,null,null,null,null,null,null,null,null,null,null,null,null,null,null,null,null,null,null,null,null,null,null,null,null,null,null,"N/E",null,null,null,null,null,null,null,null,null,null,null,null,null,null,null,null,null,null,null,null,null,null,null,null,null,null,null,null,null,null,null,"N/E"]
[null,0,0,{"$f":"IF($B$1=5,TRUE,FALSE)","v":false},null,null,0,0,0,0,null,null,"CO9.itec1. Expérimenter des procédés pour caractériser les paramètres de transformation de la matière et leurs conséquences sur la définition et l’obtention de pièces",3,null,null,null,null,null,null,null,null,null,null,null,null,null,null,null,null,null,null,null,null,null,null,null,null,null,null,null,null,null,null,null,null,null,null,null,null,"N/E",null,null,null,null,null,null,null,null,null,null,null,null,null,null,null,null,null,null,null,null,null,null,null,null,null,null,null,null,null,null,null,"N/E",null,null,null,null,null,null,null,null,null,null,null,null,null,null,null,null,null,null,null,null,null,null,null,null,null,null,null,null,null,null,null,"N/E",null,null,null,null,null,null,null,null,null,null,null,null,null,null,null,null,null,null,null,null,null,null,null,null,null,null,null,null,null,null,null,"N/E",null,null,null,null,null,null,null,null,null,null,null,null,null,null,null,null,null,null,null,null,null,null,null,null,null,null,null,null,null,null,null,"N/E"]
[null,0,0,{"$f":"IF($B$1=5,TRUE,FALSE)","v":false},null,null,0,0,0,0,null,null,"CO9.itec2. Réaliser et valider un prototype obtenu par rapport à tout ou partie du cahier des charges initial",4,null,null,null,null,null,null,null,null,null,null,null,null,null,null,null,null,null,null,null,null,null,null,null,null,null,null,null,null,null,null,null,null,null,null,null,null,"N/E",null,null,null,null,null,null,null,null,null,null,null,null,null,null,null,null,null,null,null,null,null,null,null,null,null,null,null,null,null,null,null,"N/E",null,null,null,null,null,null,null,null,null,null,null,null,null,null,null,null,null,null,null,null,null,null,null,null,null,null,null,null,null,null,null,"N/E",null,null,null,null,null,null,null,null,null,null,null,null,null,null,null,null,null,null,null,null,null,null,null,null,null,null,null,null,null,null,null,"N/E",null,null,null,null,null,null,null,null,null,null,null,null,null,null,null,null,null,null,null,null,null,null,null,null,null,null,null,null,null,null,null,"N/E"]
[null,0,0,{"$f":"IF($B$1=5,TRUE,FALSE)","v":false},null,null,0,0,0,0,null,null,"CO9.itec3. Intégrer les pièces prototypes dans le système à modifier pour valider son comportement et ses performances",4,null,null,null,null,null,null,null,null,null,null,null,null,null,null,null,null,null,null,null,null,null,null,null,null,null,null,null,null,null,null,null,null,null,null,null,null,"N/E",null,null,null,null,null,null,null,null,null,null,null,null,null,null,null,null,null,null,null,null,null,null,null,null,null,null,null,null,null,null,null,"N/E",null,null,null,null,null,null,null,null,null,null,null,null,null,null,null,null,null,null,null,null,null,null,null,null,null,null,null,null,null,null,null,"N/E",null,null,null,null,null,null,null,null,null,null,null,null,null,null,null,null,null,null,null,null,null,null,null,null,null,null,null,null,null,null,null,"N/E",null,null,null,null,null,null,null,null,null,null,null,null,null,null,null,null,null,null,null,null,null,null,null,null,null,null,null,null,null,null,null,"N/E"]
[null,0,0,{"$f":"IF($B$1=6,TRUE,FALSE)","v":false},null,null,0,0,0,0,null,null,"CO9.sin1. Utiliser les outils adaptés pour planifier un projet (diagramme de Gantt, chemin critique, données économiques, réunions de projet)",3,null,null,null,null,null,null,null,null,null,null,null,null,null,null,null,null,null,null,null,null,null,null,null,null,null,null,null,null,null,null,null,null,null,null,null,null,"N/E",null,null,null,null,null,null,null,null,null,null,null,null,null,null,null,null,null,null,null,null,null,null,null,null,null,null,null,null,null,null,null,"N/E",null,null,null,null,null,null,null,null,null,null,null,null,null,null,null,null,null,null,null,null,null,null,null,null,null,null,null,null,null,null,null,"N/E",null,null,null,null,null,null,null,null,null,null,null,null,null,null,null,null,null,null,null,null,null,null,null,null,null,null,null,null,null,null,null,"N/E",null,null,null,null,null,null,null,null,null,null,null,null,null,null,null,null,null,null,null,null,null,null,null,null,null,null,null,null,null,null,null,"N/E"]
[null,0,0,{"$f":"IF($B$1=6,TRUE,FALSE)","v":false},null,null,0,0,0,0,null,null,"CO9.sin2. Installer, configurer et instrumenter un système réel Mettre en oeuvre la chaîne d’acquisition puis acquérir, traiter, transmettre et restituer l’information",5,null,null,null,null,null,null,null,null,null,null,null,null,null,null,null,null,null,null,null,null,null,null,null,null,null,null,null,null,null,null,null,null,null,null,null,null,"N/E",null,null,null,null,null,null,null,null,null,null,null,null,null,null,null,null,null,null,null,null,null,null,null,null,null,null,null,null,null,null,null,"N/E",null,null,null,null,null,null,null,null,null,null,null,null,null,null,null,null,null,null,null,null,null,null,null,null,null,null,null,null,null,null,null,"N/E",null,null,null,null,null,null,null,null,null,null,null,null,null,null,null,null,null,null,null,null,null,null,null,null,null,null,null,null,null,null,null,"N/E",null,null,null,null,null,null,null,null,null,null,null,null,null,null,null,null,null,null,null,null,null,null,null,null,null,null,null,null,null,null,null,"N/E"]
[null,0,0,{"$f":"IF($B$1=6,TRUE,FALSE)","v":false},null,null,0,0,0,0,null,null,"CO9.sin3. Rechercher des évolutions de constituants dans le cadre d’une démarche de veille technologique, analyser la structure d'un système pour intervenir sur les constituants dans le cadre d'une opération de maintenance",4,null,null,null,null,null,null,null,null,null,null,null,null,null,null,null,null,null,null,null,null,null,null,null,null,null,null,null,null,null,null,null,null,null,null,null,null,"N/E",null,null,null,null,null,null,null,null,null,null,null,null,null,null,null,null,null,null,null,null,null,null,null,null,null,null,null,null,null,null,null,"N/E",null,null,null,null,null,null,null,null,null,null,null,null,null,null,null,null,null,null,null,null,null,null,null,null,null,null,null,null,null,null,null,"N/E",null,null,null,null,null,null,null,null,null,null,null,null,null,null,null,null,null,null,null,null,null,null,null,null,null,null,null,null,null,null,null,"N/E",null,null,null,null,null,null,null,null,null,null,null,null,null,null,null,null,null,null,null,null,null,null,null,null,null,null,null,null,null,null,null,"N/E"]
[null,0,0,{"$f":"IF($B$1=6,TRUE,FALSE)","v":false},null,null,0,0,0,0,null,null,"CO9.sin4. Rechercher et choisir de nouveaux constituants d’un système (ou d’un projet finalisé) au regard d’évolutions technologiques, socio-économiques spécifiées dans un cahier des charges. Organiser le projet permettant de « maquettiser » la solution choisie",5,null,null,null,null,null,null,null,null,null,null,null,null,null,null,null,null,null,null,null,null,null,null,null,null,null,null,null,null,null,null,null,null,null,null,null,null,"N/E",null,null,null,null,null,null,null,null,null,null,null,null,null,null,null,null,null,null,null,null,null,null,null,null,null,null,null,null,null,null,null,"N/E",null,null,null,null,null,null,null,null,null,null,null,null,null,null,null,null,null,null,null,null,null,null,null,null,null,null,null,null,null,null,null,"N/E",null,null,null,null,null,null,null,null,null,null,null,null,null,null,null,null,null,null,null,null,null,null,null,null,null,null,null,null,null,null,null,"N/E",null,null,null,null,null,null,null,null,null,null,null,null,null,null,null,null,null,null,null,null,null,null,null,null,null,null,null,null,null,null,null,"N/E"]
[null,null,null,{"$f":"IF($B$1=2,TRUE,FALSE)","v":false},null,null,null,null,null,null,null,"B","-  Modéliser",0.4]
[null,null,null,false,null,null,null,null,null,null,null,null,"B3 - Résoudre et simuler : Simuler le fonctionnement de tout ou partie d’un système à l’aide d’un modèle fourni"]
[null,{"$f":"N62*D62*$N$60","v":0},{"$f":"IF(COUNTA(T62:CD62)<>0,N62,0)","v":0.2},false,null,null,0,0,0,0,null,null,"Les paramètres influents sont identifiés",0.2,null,null,null,null,null,null,null,null,null,null,null,null,null,null,null,null,null,null,null,null,null,null,null,null,null,null,null,null,null,null,null,null,null,null,null,null,{"$f":"IF(AND(AY$1<>\"\",COUNTA(U62:AX62)>0),\"OK\",\"N/E\")","v":"N/E"},null,null,null,null,null,null,null,null,null,null,null,null,null,null,null,null,null,null,null,null,null,null,null,null,null,null,null,null,null,null,null,{"$f":"IF(AND(CE$1<>\"\",COUNTA(U62:CD62)>1),\"OK\",\"N/E\")","v":"N/E"},null,null,null,null,null,null,null,null,null,null,null,null,null,null,null,null,null,null,null,null,null,null,null,null,null,null,null,null,null,null,null,{"$f":"IF(AND(DK$1<>\"\",COUNTA(U62:DJ62)>2),\"OK\",\"N/E\")","v":"N/E"},null,null,null,null,null,null,null,null,null,null,null,null,null,null,null,null,null,null,null,null,null,null,null,null,null,null,null,null,null,null,null,{"$f":"IF(AND(EQ$1<>\"\",COUNTA(U62:EP62)>3),\"OK\",\"N/E\")","v":"N/E"},null,null,null,null,null,null,null,null,null,null,null,null,null,null,null,null,null,null,null,null,null,null,null,null,null,null,null,null,null,null,null,{"$f":"IF(AND(FW$1<>\"\",COUNTA(U62:FV62)>4),\"OK\",\"N/E\")","v":"N/E"}]
[null,{"$f":"N63*D63*$N$60","v":0},0.2,false,null,null,0,0,0,0,null,null,"Les limites de simulation sont correctement définies",0.2,null,null,null,null,null,null,null,null,null,null,null,null,null,null,null,null,null,null,null,null,null,null,null,null,null,null,null,null,null,null,null,null,null,null,null,null,{"$f":"IF(AND(AY$1<>\"\",COUNTA(U63:AX63)>0),\"OK\",\"N/E\")","v":"N/E"},null,null,null,null,null,null,null,null,null,null,null,null,null,null,null,null,null,null,null,null,null,null,null,null,null,null,null,null,null,null,null,{"$f":"IF(AND(CE$1<>\"\",COUNTA(U63:CD63)>1),\"OK\",\"N/E\")","v":"N/E"},null,null,null,null,null,null,null,null,null,null,null,null,null,null,null,null,null,null,null,null,null,null,null,null,null,null,null,null,null,null,null,{"$f":"IF(AND(DK$1<>\"\",COUNTA(U63:DJ63)>2),\"OK\",\"N/E\")","v":"N/E"},null,null,null,null,null,null,null,null,null,null,null,null,null,null,null,null,null,null,null,null,null,null,null,null,null,null,null,null,null,null,null,{"$f":"IF(AND(EQ$1<>\"\",COUNTA(U63:EP63)>3),\"OK\",\"N/E\")","v":"N/E"},null,null,null,null,null,null,null,null,null,null,null,null,null,null,null,null,null,null,null,null,null,null,null,null,null,null,null,null,null,null,null,{"$f":"IF(AND(FW$1<>\"\",COUNTA(U63:FV63)>4),\"OK\",\"N/E\")","v":"N/E"}]
[null,null,null,false,null,null,null,null,null,null,null,null,"B4 - Valider un modèle : Valider un modèle fourni, interpréter les résultats obtenus, préciser les limites de validité du modèle utilisé et modifier les paramètres du modèle pour répondre au cahier des charges ou aux résultats expérimentaux"]
[null,{"$f":"N65*D65*$N$60","v":0},0.15,false,null,null,0,0,0,0,null,null,"Les résultats sont correctement interprétés",0.15,null,null,null,null,null,null,null,null,null,null,null,null,null,null,null,null,null,null,null,null,null,null,null,null,null,null,null,null,null,null,null,null,null,null,null,null,">",null,null,null,null,null,null,null,null,null,null,null,null,null,null,null,null,null,null,null,null,null,null,null,null,null,null,null,null,null,null,null,">",null,null,null,null,null,null,null,null,null,null,null,null,null,null,null,null,null,null,null,null,null,null,null,null,null,null,null,null,null,null,null,">",null,null,null,null,null,null,null,null,null,null,null,null,null,null,null,null,null,null,null,null,null,null,null,null,null,null,null,null,null,null,null,">",null,null,null,null,null,null,null,null,null,null,null,null,null,null,null,null,null,null,null,null,null,null,null,null,null,null,null,null,null,null,null,">",{"$f":"IF(COUNTA(U65:FW65)>5,\"OK\",\"N/E\")","v":"N/E"}]
[null,{"$f":"N66*D66*$N$60","v":0},0.15,false,null,null,0,0,0,0,null,null,"Ces limites sont explicitées",0.15,null,null,null,null,null,null,null,null,null,null,null,null,null,null,null,null,null,null,null,null,null,null,null,null,null,null,null,null,null,null,null,null,null,null,null,null,">",null,null,null,null,null,null,null,null,null,null,null,null,null,null,null,null,null,null,null,null,null,null,null,null,null,null,null,null,null,null,null,">",null,null,null,null,null,null,null,null,null,null,null,null,null,null,null,null,null,null,null,null,null,null,null,null,null,null,null,null,null,null,null,">",null,null,null,null,null,null,null,null,null,null,null,null,null,null,null,null,null,null,null,null,null,null,null,null,null,null,null,null,null,null,null,">",null,null,null,null,null,null,null,null,null,null,null,null,null,null,null,null,null,null,null,null,null,null,null,null,null,null,null,null,null,null,null,">",{"$f":"IF(COUNTA(U66:FW66)>5,\"OK\",\"N/E\")","v":"N/E"}]
[null,{"$f":"N67*D67*$N$60","v":0},0.15,false,null,null,0,0,0,0,null,null,"Les paramètres modifiés sont pertinents",0.15,null,null,null,null,null,null,null,null,null,null,null,null,null,null,null,null,null,null,null,null,null,null,null,null,null,null,null,null,null,null,null,null,null,null,null,null,">",null,null,null,null,null,null,null,null,null,null,null,null,null,null,null,null,null,null,null,null,null,null,null,null,null,null,null,null,null,null,null,">",null,null,null,null,null,null,null,null,null,null,null,null,null,null,null,null,null,null,null,null,null,null,null,null,null,null,null,null,null,null,null,">",null,null,null,null,null,null,null,null,null,null,null,null,null,null,null,null,null,null,null,null,null,null,null,null,null,null,null,null,null,null,null,">",null,null,null,null,null,null,null,null,null,null,null,null,null,null,null,null,null,null,null,null,null,null,null,null,null,null,null,null,null,null,null,">",{"$f":"IF(COUNTA(U67:FW67)>5,\"OK\",\"N/E\")","v":"N/E"}]
[null,{"$f":"N68*D68*$N$60","v":0},0.15,false,null,null,0,0,0,0,null,null,"Le modèle modifié répond aux attentes ",0.15,null,null,null,null,null,null,null,null,null,null,null,null,null,null,null,null,null,null,null,null,null,null,null,null,null,null,null,null,null,null,null,null,null,null,null,null,">",null,null,null,null,null,null,null,null,null,null,null,null,null,null,null,null,null,null,null,null,null,null,null,null,null,null,null,null,null,null,null,">",null,null,null,null,null,null,null,null,null,null,null,null,null,null,null,null,null,null,null,null,null,null,null,null,null,null,null,null,null,null,null,">",null,null,null,null,null,null,null,null,null,null,null,null,null,null,null,null,null,null,null,null,null,null,null,null,null,null,null,null,null,null,null,">",null,null,null,null,null,null,null,null,null,null,null,null,null,null,null,null,null,null,null,null,null,null,null,null,null,null,null,null,null,null,null,">",{"$f":"IF(COUNTA(U68:FW68)>5,\"OK\",\"N/E\")","v":"N/E"}]
[null,null,null,false,null,null,null,null,null,null,null,"C","-  Expérimenter",0.4]
[null,null,null,false,null,null,null,null,null,null,null,null," C1 - Justifier le choix d’un protocole expérimental : Identifier les grandeurs physiques à mesurer, décrire une chaîne d'acquisition, identifier le comportement des composants et justifier le choix des essais réalisés"]
[null,{"$f":"N71*D71*$N$69","v":0},{"$f":"IF(COUNTA(T71:CD71)<>0,N71,0)","v":0.08},false,null,null,{"$f":"IF($FX71=\"\",$B71,0)","v":0},{"$f":"IF(OR($AY71=\"OK\",$CE71=\"OK\",$DK71=\"OK\",$EQ71=\"OK\",$FW71=\"OK\"),$B71,0)","v":0},{"$f":"IF($FX71=\"\",0,$B71)","v":0},{"$f":"IF($FX71=\"OK\",$B71,0)","v":0},null,null,"Les grandeurs spécifiques (d'entrée, sortie, matière d'œuvre…) sont correctement identifiées",0.08,null,null,null,null,null,null,null,null,null,null,null,null,null,null,null,null,null,null,null,null,null,null,null,null,null,null,null,null,null,null,null,null,null,null,null,null,{"$f":"IF(AND(AY$1<>\"\",COUNTA(U71:AX71)>0),\"OK\",\"N/E\")","v":"N/E"},null,null,null,null,null,null,null,null,null,null,null,null,null,null,null,null,null,null,null,null,null,null,null,null,null,null,null,null,null,null,null,{"$f":"IF(AND(CE$1<>\"\",COUNTA(U71:CD71)>1),\"OK\",\"N/E\")","v":"N/E"},null,null,null,null,null,null,null,null,null,null,null,null,null,null,null,null,null,null,null,null,null,null,null,null,null,null,null,null,null,null,null,{"$f":"IF(AND(DK$1<>\"\",COUNTA(U71:DJ71)>2),\"OK\",\"N/E\")","v":"N/E"},null,null,null,null,null,null,null,null,null,null,null,null,null,null,null,null,null,null,null,null,null,null,null,null,null,null,null,null,null,null,null,{"$f":"IF(AND(EQ$1<>\"\",COUNTA(U71:EP71)>3),\"OK\",\"N/E\")","v":"N/E"},null,null,null,null,null,null,null,null,null,null,null,null,null,null,null,null,null,null,null,null,null,null,null,null,null,null,null,null,null,null,null,{"$f":"IF(AND(FW$1<>\"\",COUNTA(U71:FV71)>4),\"OK\",\"N/E\")","v":"N/E"}]
[null,{"$f":"N72*D72*$N$69","v":0},0.08,false,null,null,0,0,0,0,null,null,"Les éléments de la chaîne sont correctement identifiés ",0.08,null,null,null,null,null,null,null,null,null,null,null,null,null,null,null,null,null,null,null,null,null,null,null,null,null,null,null,null,null,null,null,null,null,null,null,null,{"$f":"IF(AND(AY$1<>\"\",COUNTA(U72:AX72)>0),\"OK\",\"N/E\")","v":"N/E"},null,null,null,null,null,null,null,null,null,null,null,null,null,null,null,null,null,null,null,null,null,null,null,null,null,null,null,null,null,null,null,{"$f":"IF(AND(CE$1<>\"\",COUNTA(U72:CD72)>1),\"OK\",\"N/E\")","v":"N/E"},null,null,null,null,null,null,null,null,null,null,null,null,null,null,null,null,null,null,null,null,null,null,null,null,null,null,null,null,null,null,null,{"$f":"IF(AND(DK$1<>\"\",COUNTA(U72:DJ72)>2),\"OK\",\"N/E\")","v":"N/E"},null,null,null,null,null,null,null,null,null,null,null,null,null,null,null,null,null,null,null,null,null,null,null,null,null,null,null,null,null,null,null,{"$f":"IF(AND(EQ$1<>\"\",COUNTA(U72:EP72)>3),\"OK\",\"N/E\")","v":"N/E"},null,null,null,null,null,null,null,null,null,null,null,null,null,null,null,null,null,null,null,null,null,null,null,null,null,null,null,null,null,null,null,{"$f":"IF(AND(FW$1<>\"\",COUNTA(U72:FV72)>4),\"OK\",\"N/E\")","v":"N/E"}]
[null,{"$f":"N73*D73*$N$69","v":0},7.0000000000000007E-2,false,null,null,0,0,0,0,null,null,"Les choix et réglages des capteurs et appareils de mesure sont correctement explicités",7.0000000000000007E-2,null,null,null,null,null,null,null,null,null,null,null,null,null,null,null,null,null,null,null,null,null,null,null,null,null,null,null,null,null,null,null,null,null,null,null,null,{"$f":"IF(AND(AY$1<>\"\",COUNTA(U73:AX73)>0),\"OK\",\"N/E\")","v":"N/E"},null,null,null,null,null,null,null,null,null,null,null,null,null,null,null,null,null,null,null,null,null,null,null,null,null,null,null,null,null,null,null,{"$f":"IF(AND(CE$1<>\"\",COUNTA(U73:CD73)>1),\"OK\",\"N/E\")","v":"N/E"},null,null,null,null,null,null,null,null,null,null,null,null,null,null,null,null,null,null,null,null,null,null,null,null,null,null,null,null,null,null,null,{"$f":"IF(AND(DK$1<>\"\",COUNTA(U73:DJ73)>2),\"OK\",\"N/E\")","v":"N/E"},null,null,null,null,null,null,null,null,null,null,null,null,null,null,null,null,null,null,null,null,null,null,null,null,null,null,null,null,null,null,null,{"$f":"IF(AND(EQ$1<>\"\",COUNTA(U73:EP73)>3),\"OK\",\"N/E\")","v":"N/E"},null,null,null,null,null,null,null,null,null,null,null,null,null,null,null,null,null,null,null,null,null,null,null,null,null,null,null,null,null,null,null,{"$f":"IF(AND(FW$1<>\"\",COUNTA(U73:FV73)>4),\"OK\",\"N/E\")","v":"N/E"}]
[null,{"$f":"N74*D74*$N$69","v":0},0.1,false,null,null,0,0,0,0,null,null,"Un protocole expérimental adapté de recueil de résultats est conçu ou complété, validé et mis en œuvre",0.1,null,null,null,null,null,null,null,null,null,null,null,null,null,null,null,null,null,null,null,null,null,null,null,null,null,null,null,null,null,null,null,null,null,null,null,null,{"$f":"IF(AND(AY$1<>\"\",COUNTA(U74:AX74)>0),\"OK\",\"N/E\")","v":"N/E"},null,null,null,null,null,null,null,null,null,null,null,null,null,null,null,null,null,null,null,null,null,null,null,null,null,null,null,null,null,null,null,{"$f":"IF(AND(CE$1<>\"\",COUNTA(U74:CD74)>1),\"OK\",\"N/E\")","v":"N/E"},null,null,null,null,null,null,null,null,null,null,null,null,null,null,null,null,null,null,null,null,null,null,null,null,null,null,null,null,null,null,null,{"$f":"IF(AND(DK$1<>\"\",COUNTA(U74:DJ74)>2),\"OK\",\"N/E\")","v":"N/E"},null,null,null,null,null,null,null,null,null,null,null,null,null,null,null,null,null,null,null,null,null,null,null,null,null,null,null,null,null,null,null,{"$f":"IF(AND(EQ$1<>\"\",COUNTA(U74:EP74)>3),\"OK\",\"N/E\")","v":"N/E"},null,null,null,null,null,null,null,null,null,null,null,null,null,null,null,null,null,null,null,null,null,null,null,null,null,null,null,null,null,null,null,{"$f":"IF(AND(FW$1<>\"\",COUNTA(U74:FV74)>4),\"OK\",\"N/E\")","v":"N/E"}]
[null,{"$f":"N75*D75*$N$69","v":0},0.05,false,null,null,0,0,0,0,null,null,"Le comportement est précisément décrit",0.05,null,null,null,null,null,null,null,null,null,null,null,null,null,null,null,null,null,null,null,null,null,null,null,null,null,null,null,null,null,null,null,null,null,null,null,null,">",null,null,null,null,null,null,null,null,null,null,null,null,null,null,null,null,null,null,null,null,null,null,null,null,null,null,null,null,null,null,null,">",null,null,null,null,null,null,null,null,null,null,null,null,null,null,null,null,null,null,null,null,null,null,null,null,null,null,null,null,null,null,null,">",null,null,null,null,null,null,null,null,null,null,null,null,null,null,null,null,null,null,null,null,null,null,null,null,null,null,null,null,null,null,null,">",null,null,null,null,null,null,null,null,null,null,null,null,null,null,null,null,null,null,null,null,null,null,null,null,null,null,null,null,null,null,null,">",{"$f":"IF(COUNTA(U75:FW75)>5,\"OK\",\"N/E\")","v":"N/E"}]
[null,null,null,false,null,null,null,null,null,null,null,null,"C2 - Mettre en œuvre un protocole expérimental : Conduire les essais en respectant les consignes de sécurité à partir d’un protocole fourni et traiter les données mesurées en vue d’analyser les écarts"]
[null,{"$f":"N77*D77*$N$69","v":0},0.08,false,null,null,0,0,0,0,null,null,"Les capteurs et appareils de mesure sont correctement mis en œuvre",0.08,null,null,null,null,null,null,null,null,null,null,null,null,null,null,null,null,null,null,null,null,null,null,null,null,null,null,null,null,null,null,null,null,null,null,null,null,{"$f":"IF(AND(AY$1<>\"\",COUNTA(U77:AX77)>0),\"OK\",\"N/E\")","v":"N/E"},null,null,null,null,null,null,null,null,null,null,null,null,null,null,null,null,null,null,null,null,null,null,null,null,null,null,null,null,null,null,null,{"$f":"IF(AND(CE$1<>\"\",COUNTA(U77:CD77)>1),\"OK\",\"N/E\")","v":"N/E"},null,null,null,null,null,null,null,null,null,null,null,null,null,null,null,null,null,null,null,null,null,null,null,null,null,null,null,null,null,null,null,{"$f":"IF(AND(DK$1<>\"\",COUNTA(U77:DJ77)>2),\"OK\",\"N/E\")","v":"N/E"},null,null,null,null,null,null,null,null,null,null,null,null,null,null,null,null,null,null,null,null,null,null,null,null,null,null,null,null,null,null,null,{"$f":"IF(AND(EQ$1<>\"\",COUNTA(U77:EP77)>3),\"OK\",\"N/E\")","v":"N/E"},null,null,null,null,null,null,null,null,null,null,null,null,null,null,null,null,null,null,null,null,null,null,null,null,null,null,null,null,null,null,null,{"$f":"IF(AND(FW$1<>\"\",COUNTA(U77:FV77)>4),\"OK\",\"N/E\")","v":"N/E"}]
[null,0,0.08,false,null,null,0,0,0,0,null,null,"Le système étudié est correctement mis en œuvre",0.08,null,null,null,null,null,null,null,null,null,null,null,null,null,null,null,null,null,null,null,null,null,null,null,null,null,null,null,null,null,null,null,null,null,null,null,null,"N/E",null,null,null,null,null,null,null,null,null,null,null,null,null,null,null,null,null,null,null,null,null,null,null,null,null,null,null,null,null,null,null,"N/E",null,null,null,null,null,null,null,null,null,null,null,null,null,null,null,null,null,null,null,null,null,null,null,null,null,null,null,null,null,null,null,"N/E",null,null,null,null,null,null,null,null,null,null,null,null,null,null,null,null,null,null,null,null,null,null,null,null,null,null,null,null,null,null,null,"N/E",null,null,null,null,null,null,null,null,null,null,null,null,null,null,null,null,null,null,null,null,null,null,null,null,null,null,null,null,null,null,null,"N/E"]
[null,0,0.08,false,null,null,0,0,0,0,null,null,"Les règles de sécurité sont connues et respectées",0.08,null,null,null,null,null,null,null,null,null,null,null,null,null,null,null,null,null,null,null,null,null,null,null,null,null,null,null,null,null,null,null,null,null,null,null,null,"N/E",null,null,null,null,null,null,null,null,null,null,null,null,null,null,null,null,null,null,null,null,null,null,null,null,null,null,null,null,null,null,null,"N/E",null,null,null,null,null,null,null,null,null,null,null,null,null,null,null,null,null,null,null,null,null,null,null,null,null,null,null,null,null,null,null,"N/E",null,null,null,null,null,null,null,null,null,null,null,null,null,null,null,null,null,null,null,null,null,null,null,null,null,null,null,null,null,null,null,"N/E",null,null,null,null,null,null,null,null,null,null,null,null,null,null,null,null,null,null,null,null,null,null,null,null,null,null,null,null,null,null,null,"N/E"]
[null,0,0.09,false,null,null,0,0,0,0,null,null,"Les résultats sont présentés clairement",0.09,null,null,null,null,null,null,null,null,null,null,null,null,null,null,null,null,null,null,null,null,null,null,null,null,null,null,null,null,null,null,null,null,null,null,null,null,"N/E",null,null,null,null,null,null,null,null,null,null,null,null,null,null,null,null,null,null,null,null,null,null,null,null,null,null,null,null,null,null,null,"N/E",null,null,null,null,null,null,null,null,null,null,null,null,null,null,null,null,null,null,null,null,null,null,null,null,null,null,null,null,null,null,null,"N/E",null,null,null,null,null,null,null,null,null,null,null,null,null,null,null,null,null,null,null,null,null,null,null,null,null,null,null,null,null,null,null,"N/E",null,null,null,null,null,null,null,null,null,null,null,null,null,null,null,null,null,null,null,null,null,null,null,null,null,null,null,null,null,null,null,"N/E"]
[null,0,0.1,false,null,null,0,0,0,0,null,null,"Les protocole d'essai est respecté",0.1,null,null,null,null,null,null,null,null,null,null,null,null,null,null,null,null,null,null,null,null,null,null,null,null,null,null,null,null,null,null,null,null,null,null,null,null,"N/E",null,null,null,null,null,null,null,null,null,null,null,null,null,null,null,null,null,null,null,null,null,null,null,null,null,null,null,null,null,null,null,"N/E",null,null,null,null,null,null,null,null,null,null,null,null,null,null,null,null,null,null,null,null,null,null,null,null,null,null,null,null,null,null,null,"N/E",null,null,null,null,null,null,null,null,null,null,null,null,null,null,null,null,null,null,null,null,null,null,null,null,null,null,null,null,null,null,null,"N/E",null,null,null,null,null,null,null,null,null,null,null,null,null,null,null,null,null,null,null,null,null,null,null,null,null,null,null,null,null,null,null,"N/E"]
[null,0,0.09,false,null,null,0,0,0,0,null,null,"Les méthodes et outils de traitement sont cohérents avec le problème posé",0.09,null,null,null,null,null,null,null,null,null,null,null,null,null,null,null,null,null,null,null,null,null,null,null,null,null,null,null,null,null,null,null,null,null,null,null,null,"N/E",null,null,null,null,null,null,null,null,null,null,null,null,null,null,null,null,null,null,null,null,null,null,null,null,null,null,null,null,null,null,null,"N/E",null,null,null,null,null,null,null,null,null,null,null,null,null,null,null,null,null,null,null,null,null,null,null,null,null,null,null,null,null,null,null,"N/E",null,null,null,null,null,null,null,null,null,null,null,null,null,null,null,null,null,null,null,null,null,null,null,null,null,null,null,null,null,null,null,"N/E",null,null,null,null,null,null,null,null,null,null,null,null,null,null,null,null,null,null,null,null,null,null,null,null,null,null,null,null,null,null,null,"N/E"]
[null,0,0.1,false,null,null,0,0,0,0,null,null,"Les résultats sont correctement analysés",0.1,null,null,null,null,null,null,null,null,null,null,null,null,null,null,null,null,null,null,null,null,null,null,null,null,null,null,null,null,null,null,null,null,null,null,null,null,">",null,null,null,null,null,null,null,null,null,null,null,null,null,null,null,null,null,null,null,null,null,null,null,null,null,null,null,null,null,null,null,">",null,null,null,null,null,null,null,null,null,null,null,null,null,null,null,null,null,null,null,null,null,null,null,null,null,null,null,null,null,null,null,">",null,null,null,null,null,null,null,null,null,null,null,null,null,null,null,null,null,null,null,null,null,null,null,null,null,null,null,null,null,null,null,">",null,null,null,null,null,null,null,null,null,null,null,null,null,null,null,null,null,null,null,null,null,null,null,null,null,null,null,null,null,null,null,">",{"$f":"IF(COUNTA(U83:FW83)>5,\"OK\",\"N/E\")","v":"N/E"}]
[null,null,null,false,null,null,null,null,null,null,null,"D","-  Communiquer",0.2]
[null,null,null,false,null,null,null,null,null,null,null,null,"D1 - Rechercher et traiter des informations : Rechercher des informations, analyser, choisir et classer des informations"]
[null,{"$f":"N86*D86*$N$84","v":0},{"$f":"IF(COUNTA(T86:CD86)<>0,N86,0)","v":0.1},false,null,null,0,0,0,0,null,null,"Les outils de recherche documentaire sont bien choisis",0.1,null,null,null,null,null,null,null,null,null,null,null,null,null,null,null,null,null,null,null,null,null,null,null,null,null,null,null,null,null,null,null,null,null,null,null,null,">",null,null,null,null,null,null,null,null,null,null,null,null,null,null,null,null,null,null,null,null,null,null,null,null,null,null,null,null,null,null,null,">",null,null,null,null,null,null,null,null,null,null,null,null,null,null,null,null,null,null,null,null,null,null,null,null,null,null,null,null,null,null,null,">",null,null,null,null,null,null,null,null,null,null,null,null,null,null,null,null,null,null,null,null,null,null,null,null,null,null,null,null,null,null,null,">",null,null,null,null,null,null,null,null,null,null,null,null,null,null,null,null,null,null,null,null,null,null,null,null,null,null,null,null,null,null,null,">",{"$f":"IF(COUNTA(U86:FW86)>5,\"OK\",\"N/E\")","v":"N/E"}]
[null,{"$f":"N87*D87*$N$84","v":0},{"$f":"IF(COUNTA(T87:CD87)<>0,N87,0)","v":0.05},false,null,null,0,0,0,0,null,null,"Les techniques de recherche documentaire sont maîtrisées",0.05,null,null,null,null,null,null,null,null,null,null,null,null,null,null,null,null,null,null,null,null,null,null,null,null,null,null,null,null,null,null,null,null,null,null,null,null,">",null,null,null,null,null,null,null,null,null,null,null,null,null,null,null,null,null,null,null,null,null,null,null,null,null,null,null,null,null,null,null,">",null,null,null,null,null,null,null,null,null,null,null,null,null,null,null,null,null,null,null,null,null,null,null,null,null,null,null,null,null,null,null,">",null,null,null,null,null,null,null,null,null,null,null,null,null,null,null,null,null,null,null,null,null,null,null,null,null,null,null,null,null,null,null,">",null,null,null,null,null,null,null,null,null,null,null,null,null,null,null,null,null,null,null,null,null,null,null,null,null,null,null,null,null,null,null,">",{"$f":"IF(COUNTA(U87:FW87)>5,\"OK\",\"N/E\")","v":"N/E"}]
[null,{"$f":"N88*D88*$N$84","v":0},{"$f":"IF(COUNTA(T88:CD88)<>0,N88,0)","v":0.05},false,null,null,0,0,0,0,null,null,"Les informations conservées sont opportunes",0.05,null,null,null,null,null,null,null,null,null,null,null,null,null,null,null,null,null,null,null,null,null,null,null,null,null,null,null,null,null,null,null,null,null,null,null,null,">",null,null,null,null,null,null,null,null,null,null,null,null,null,null,null,null,null,null,null,null,null,null,null,null,null,null,null,null,null,null,null,">",null,null,null,null,null,null,null,null,null,null,null,null,null,null,null,null,null,null,null,null,null,null,null,null,null,null,null,null,null,null,null,">",null,null,null,null,null,null,null,null,null,null,null,null,null,null,null,null,null,null,null,null,null,null,null,null,null,null,null,null,null,null,null,">",null,null,null,null,null,null,null,null,null,null,null,null,null,null,null,null,null,null,null,null,null,null,null,null,null,null,null,null,null,null,null,">",{"$f":"IF(COUNTA(U88:FW88)>5,\"OK\",\"N/E\")","v":"N/E"}]
[null,{"$f":"N89*D89*$N$84","v":0},{"$f":"IF(COUNTA(T89:CD89)<>0,N89,0)","v":0.1},false,null,null,0,0,0,0,null,null,"Le classement des données permet de les retrouver rapidement",0.1,null,null,null,null,null,null,null,null,null,null,null,null,null,null,null,null,null,null,null,null,null,null,null,null,null,null,null,null,null,null,null,null,null,null,null,null,">",null,null,null,null,null,null,null,null,null,null,null,null,null,null,null,null,null,null,null,null,null,null,null,null,null,null,null,null,null,null,null,">",null,null,null,null,null,null,null,null,null,null,null,null,null,null,null,null,null,null,null,null,null,null,null,null,null,null,null,null,null,null,null,">",null,null,null,null,null,null,null,null,null,null,null,null,null,null,null,null,null,null,null,null,null,null,null,null,null,null,null,null,null,null,null,">",null,null,null,null,null,null,null,null,null,null,null,null,null,null,null,null,null,null,null,null,null,null,null,null,null,null,null,null,null,null,null,">",{"$f":"IF(COUNTA(U89:FW89)>5,\"OK\",\"N/E\")","v":"N/E"}]
[null,null,null,false,null,null,null,null,null,null,null,null,"D2 - Mettre en œuvre une communication : Choisir un support de communication et un média adapté, argumenter, produire un support de communication et adapter sa stratégie de communication au contexte"]
[null,{"$f":"N91*D91*$N$84","v":0},{"$f":"IF(COUNTA(T91:CD91)<>0,N91,0)","v":0.2},false,null,null,0,0,0,0,null,null,"Les outils de communication sont maîtrisés",0.2,null,null,null,null,null,null,null,null,null,null,null,null,null,null,null,null,null,null,null,null,null,null,null,null,null,null,null,null,null,null,null,null,null,null,null,null,">",null,null,null,null,null,null,null,null,null,null,null,null,null,null,null,null,null,null,null,null,null,null,null,null,null,null,null,null,null,null,null,">",null,null,null,null,null,null,null,null,null,null,null,null,null,null,null,null,null,null,null,null,null,null,null,null,null,null,null,null,null,null,null,">",null,null,null,null,null,null,null,null,null,null,null,null,null,null,null,null,null,null,null,null,null,null,null,null,null,null,null,null,null,null,null,">",null,null,null,null,null,null,null,null,null,null,null,null,null,null,null,null,null,null,null,null,null,null,null,null,null,null,null,null,null,null,null,">",{"$f":"IF(COUNTA(U91:FW91)>5,\"OK\",\"N/E\")","v":"N/E"}]
[null,{"$f":"N92*D92*$N$84","v":0},{"$f":"IF(COUNTA(T92:CD92)<>0,N92,0)","v":0.1},false,null,null,0,0,0,0,null,null,"Le support utilisé est adapté",0.1,null,null,null,null,null,null,null,null,null,null,null,null,null,null,null,null,null,null,null,null,null,null,null,null,null,null,null,null,null,null,null,null,null,null,null,null,">",null,null,null,null,null,null,null,null,null,null,null,null,null,null,null,null,null,null,null,null,null,null,null,null,null,null,null,null,null,null,null,">",null,null,null,null,null,null,null,null,null,null,null,null,null,null,null,null,null,null,null,null,null,null,null,null,null,null,null,null,null,null,null,">",null,null,null,null,null,null,null,null,null,null,null,null,null,null,null,null,null,null,null,null,null,null,null,null,null,null,null,null,null,null,null,">",null,null,null,null,null,null,null,null,null,null,null,null,null,null,null,null,null,null,null,null,null,null,null,null,null,null,null,null,null,null,null,">",{"$f":"IF(COUNTA(U92:FW92)>5,\"OK\",\"N/E\")","v":"N/E"}]
[null,{"$f":"N93*D93*$N$84","v":0},{"$f":"IF(COUNTA(T93:CD93)<>0,N93,0)","v":0.2},false,null,null,0,0,0,0,null,null,"La production finale permet la compréhension du problème et de sa résolution ",0.2,null,null,null,null,null,null,null,null,null,null,null,null,null,null,null,null,null,null,null,null,null,null,null,null,null,null,null,null,null,null,null,null,null,null,null,null,">",null,null,null,null,null,null,null,null,null,null,null,null,null,null,null,null,null,null,null,null,null,null,null,null,null,null,null,null,null,null,null,">",null,null,null,null,null,null,null,null,null,null,null,null,null,null,null,null,null,null,null,null,null,null,null,null,null,null,null,null,null,null,null,">",null,null,null,null,null,null,null,null,null,null,null,null,null,null,null,null,null,null,null,null,null,null,null,null,null,null,null,null,null,null,null,">",null,null,null,null,null,null,null,null,null,null,null,null,null,null,null,null,null,null,null,null,null,null,null,null,null,null,null,null,null,null,null,">",{"$f":"IF(COUNTA(U93:FW93)>5,\"OK\",\"N/E\")","v":"N/E"}]
[null,{"$f":"N94*D94*$N$84","v":0},{"$f":"IF(COUNTA(T94:CD94)<>0,N94,0)","v":0.2},false,null,null,0,0,0,0,null,null,"La production respecte le cahier des charges (écrit/oral, texte/vidéo, durée, public visé, …)",0.2,null,null,null,null,null,null,null,null,null,null,null,null,null,null,null,null,null,null,null,null,null,null,null,null,null,null,null,null,null,null,null,null,null,null,null,null,">",null,null,null,null,null,null,null,null,null,null,null,null,null,null,null,null,null,null,null,null,null,null,null,null,null,null,null,null,null,null,null,">",null,null,null,null,null,null,null,null,null,null,null,null,null,null,null,null,null,null,null,null,null,null,null,null,null,null,null,null,null,null,null,">",null,null,null,null,null,null,null,null,null,null,null,null,null,null,null,null,null,null,null,null,null,null,null,null,null,null,null,null,null,null,null,">",null,null,null,null,null,null,null,null,null,null,null,null,null,null,null,null,null,null,null,null,null,null,null,null,null,null,null,null,null,null,null,">",{"$f":"IF(COUNTA(U94:FW94)>5,\"OK\",\"N/E\")","v":"N/E"}]
[null,null,null,{"$f":"IF($B$1>2,TRUE,FALSE)","v":false}]
[null,null,null,{"$f":"IF($B$1>2,TRUE,FALSE)","v":false},null,null,null,null,null,null,null,null,"Evaluation en cours d'année"]
[null,null,null,{"$f":"IF($B$1>2,TRUE,FALSE)","v":false},null,null,null,null,null,null,null,null,"Soutenance finale"]

{"sheet":"MODE EMPLOI","index":8,"n_rows":43,"n_cols":2,"rows_kept":43,"cut":false,"hidden":false,"merged":[]}
[null,"MODE D'EMPLOI"]
[]
[null,"CE DOSSIER permet de caractériser un projet proposé par les équipes pédagogiques en classe de terminale, S-SI ou STI2D, en vue d'une validation académique."]
[null,"Pour fonctionner, il faut autoriser l'activation des macros (avec une version de MSexcel 2008 au moins)."]
[null,"Cet outil est encore au stade de développement, et sera rendu plus \"robuste\" au fil du temps et des retours d'expérience"]
[]
["1.","Remplir le premier onglet (\"Synthèse\") en indiquant les éléments donnant le cadre général du projet"]
[null,"Veiller en particulier à indiquer pour chaque élève sa section (STI2D-AC, EE, ITEC, SIN ou S-SI)"]
[null,"Le contenu des menus déroulants peut être modifié en éditant les paramètres définis dans l'onglet \"paramètres\"."]
[]
["2.","Compléter le deuxième onglet (\"CdC\") définissant le cahier du charge du projet"]
[]
["3.","Décliner le projet en tâches (onglet \"Déclinaison projet\")"]
[null,"- Pour chaque étape jalonnant le projet, lister les tâches prévisionnelles à accomplir en associant à chaque tâche une estimation du temps requis"]
[null,"Pour faciliter la lecture, vous pouvez ajuster le nombre de lignes à afficher pour chaque étape du projet suivant le besoin à l'aide du menu déroulant; chaque étape est limitée à une déclinaison en 30 tâches"]
[null,"- Répartir les tâches entre les élèves en cochant les cases de la partie droite du tableau; la charge horaire pour chaque élève se calcule automatiquement"]
[null,"- Ajuster la répartition des tâches pour viser un équilibre de la charge horaire par élève d'approximativement 70h"]
[null,"- Lorsque le projet est pluri-disciplinaire, vous pouvez préciser les tâches pour lesquelles les professeurs non-STI apporte plus scpécifiquement leur contribution."]
[]
["4.","Pour chaque élève (onglet \"Eleve A\", \"Eleve B\", …):"]
[null,"Une grille apparaît avec les compétences à évaluer dans le cadre du projet, conforme à la section d'appartenance de l'élève"]
[null,"Cliquer sur l'îcone \"Mettre à jour les tâches\"; les tâches affectées à l'élève sont automatiquement reportées"]
[null,"Indiquer pour chaque tâche les compétences qui sont mobilisées, et qui seront donc évaluABLES, en cochant les cases correspondantes; il faut noter qu'une compétence évaluable ne sera pas forcément évaluée… en revanche si une compétence n'est pas évaluable, elle ne sera forcément pas évaluée! Pour respecter le cadre défini au BO, où 50% au moins des indicateurs doivent être évalués, il faut s'assurer lors de la validation qu'un nombre supérieur d'indicateurs sont évaluables, laissant ensuite de la \"marge\" lors de l'évaluation. Pour cette raison le taux affiché reste rouge entre 0 et 50%, passe à l'orange entre 50 et 75%, et passe au vert au delà de 75%."]
[null,"Le pourcentage d'indicateurs associés aux compétences évaluables est calculé automatiquement; deux valeurs sont calculeées :"]
[]
[null,"% d'indicateurs évaluables en cours d'année par rapport au total des indicateurs à évaluer en revues de projet, qui compteront pour la moitié de l'évaluation totale"]
[null,"en STI2D, le BO précise que 50% au moins des indicateurs de la grille de revues de projet devront être évaluES"]
[]
[null,"% d'indicateurs évaluables lors de la soutenance finale par rapport total des indicateurs à évaluer lors de la soutenance finale, qui compteront pour l'autre moitié de l'évaluation totale"]
[null,"en STI2D, le BO précise que 50% au moins des indicateurs de la grille de soutenance finale devront être évaluES"]
[]
[null,"% d'indicateurs globalement évaluables"]
[null,"en SSI, le BO précise que 50% au moins des indicateurs de la grille unique d'évaluation devront êtres évaluES"]
[]
["5.","Vérifier sur l'onglet \"Synthèse\" que les voyants sont au vert, ou éventuellement à l'orange."]
[]
[]
[null,"REMARQUES IMPORTANTES:"]
[null,"L'onglet \"Synthèse\" permet de s'assurer de la validité du projet"]
[null,"La spécification du projet, une fois définie, est figée (onglet CdC) pour toute la durée du projet."]
[null,"Par contre, les grilles de déclinaison du projet et validation de tâches par élèves sont renseignées initialement de façon prévisionnelles, et peuvent évoluer en cours de réalisation du projet, pour laisser la place à la dimension créative de la démarche de projet. Les équipes devront s'assurer que ces évolutions laissent toutefois les indicateurs au vert."]
[]
[null,"Cette version du fichier excel peut être encore très largement améliorée; si vous proposez des améliorations, merci d'en faire profiter l'ensemble de la communauté en envoyant vos propositions à votre corps d'inspection pédagogique et/ou à federico.berera@ac-lille.fr"]

{"sheet":"parametres","index":9,"n_rows":31,"n_cols":10,"rows_kept":31,"cut":false,"hidden":false,"merged":[]}
["Session","Etablissement","Effectif","Ref","Section","Eleves","choix","Production(s) attendue(s)","Nb tâches","Question"]
["Session 2013","Pierre Gilles de GENNES",2,2,"S-SI","Elève A",4,"Justifications scientifiques, technologiques, socio-économiques",1,"OUI"]
["Session 2014","Les Iscles ",3,3,"STI2D-AC","Elève B",4,"Architectures de solutions",2,"NON"]
["Session 2015","Altitude",4,4,"STI2D-EE","Elève C",4,"Documents de formalisation de la solution imaginée ",3]
["Session 2016","Lycée Militaire",5,5,"STI2D-ITEC","Elève D",1,"Supports de communication ",4]
["Session 2017","ST Eloi",6,6,"STI2D-SIN","Elève E",1,"Prototype ou une maquette numérique ou matérielle",5]
["Session 2018","Vauvenargues",null,null,null,null,null,null,6]
["Session 2019","Louis Pasquet ",null,null,null,null,null,null,7]
["Session 2020","Marie Madeleine Fourcade ",null,null,null,null,null,null,8]
[null,"St Louis ",null,null,null,null,null,null,9]
[null,"Méditerranée",null,null,null,null,null,null,10]
[null,"Antonin Artaud ",null,null,null,null,null,null,11]
[null,"Denis Diderot ",null,null,null,null,null,null,12]
[null,"Don Bosco",null,null,null,null,null,null,13]
[null,"Du Rempart ",null,null,null,null,null,null,14]
[null,"Jean Perrin",null,null,null,null,null,null,15]
[null,"L'Estaque",null,null,null,null,null,null,16]
[null,"Jean Lurcat",null,null,null,null,null,null,17]
[null,"Paul Langevin ",null,null,null,null,null,null,18]
[null,"Adam de Craponne ",null,null,null,null,null,null,19]
[null,"Pierre Mendes-France",null,null,null,null,null,null,20]
[null,"Saint Jean Baptiste de la Salle",null,null,null,null,null,null,21]
[null,"Philippe de Girard",null,null,null,null,null,null,22]
[null,"Fabre ",null,null,null,null,null,null,23]
[null,"Benoit",null,null,null,null,null,null,24]
[null,"………",null,null,null,null,null,null,25]
[null,null,null,null,null,null,null,null,26]
[null,null,null,null,null,null,null,null,27]
[null,null,null,null,null,null,null,null,28]
[null,null,null,null,null,null,null,null,29]
[null,null,null,null,null,null,null,null,30]